{"text_format":"1","workbook":"xlsx","n_sheets":14,"sheets":["Aktualisierungen","Erläuterungen","Eingabe","Daten-Elektrofahrzeug","Daten-Benzin-Dieselfahrzeug","Berechnungen","Förderungen","Wetterdaten","PLZ-Zuordnung","Strompreis","Motorbez. Versicherungssteuer","Enamo-Tarif","topprodukte-elektro","topprodukte-benzin-diesel"],"not_rendered":{"charts":9,"images":28,"macros":1,"external_links":0,"defined_names":41,"comments":0,"pivot_tables":0},"unopened":[],"bounds":{"document_bytes":16777216,"sheet_cells":100000,"rows_first":2000,"rows_last":500,"rows_between":2000,"halvings":0,"cell_chars":16384,"cell_head_chars":4096},"cells_cut":0,"cells_raw":0,"read":"whole","date_system":"1900"}

{"sheet":"Aktualisierungen","index":0,"n_rows":0,"n_cols":0,"rows_kept":0,"cut":false,"hidden":true,"merged":[[4,0,4,8],[5,0,5,8]]}

{"sheet":"Erläuterungen","index":1,"n_rows":0,"n_cols":0,"rows_kept":0,"cut":false,"hidden":true,"merged":[[4,0,4,8],[5,0,5,8],[21,1,21,4],[22,1,22,7]]}

{"sheet":"Eingabe","index":2,"n_rows":149,"n_cols":43,"rows_kept":149,"cut":false,"hidden":false,"merged":[[102,3,102,27],[96,3,96,27],[35,2,35,3],[94,6,94,10],[95,6,95,10],[94,3,94,5],[95,3,95,5],[93,3,93,27],[79,5,79,10],[79,11,79,14],[35,35,35,36],[25,15,25,18],[25,5,25,10],[25,11,25,14],[71,11,71,14],[71,5,71,10],[35,31,35,32],[35,33,35,34],[55,5,55,10],[55,11,55,14],[55,15,55,18],[38,15,38,18],[38,5,38,10],[38,11,38,14],[1,1,1,16],[15,15,15,18],[19,15,19,18],[0,2,0,8],[9,5,9,10],[9,11,9,14],[15,12,15,13],[11,12,12,13],[11,6,11,9],[7,6,7,9],[15,6,15,9],[16,6,16,7],[5,21,12,27],[22,6,22,7],[81,12,81,17],[84,12,84,17],[17,6,17,7],[18,6,18,7],[19,6,19,7],[20,6,20,7],[21,6,21,7],[11,16,11,18],[12,6,12,7]]}
[null,null,null,null,null,null,null,null,null,null,null,null,null,null,null,null,null,null,null,null,null,null,null,null,null,null,null,null,null,null,null,null,null,null,null,null,"Jahreseinkommen",25000,{"$f":"M29*0.015","v":730.35},{"$f":"20.68/100*AM1","v":151.03637999999998},{"$f":"AM1*AQ9/100","v":255.6225},{"$f":"SUM(AN1:AO1)","v":406.65887999999995}]
[null,"E-Mobilitätsrechner\nE_MOB_Rechner_0325_Vers.7.2",null,null,null,null,null,null,null,null,null,null,null,null,null,null,null,null,null,null,null,null,null,null,null,null,null,null,null,null,null,null,null,null,null,null,null,"Jahr der Anschaffung","CO2 Grenzwert",null,"Einkommen","Einkommenssteuer"]
[null,null,null,null,null,null,null,null,null,null,null,null,null,null,null,null,null,null,null,null,null,null,null,null,null,null,null,null,null,null,null,null,null,null,null,null,null,2016,130,null,11000,0]
[null,null,"1. Fahrzeugauswahl",null,null,null,null,null,null,null,null,null,null,null,null,null,null,null,null,null,null,"7. Ausfüllhilfe",null,null,null,null,null,null,null,null,null,null,null,null,null,null,null,2017,127,null,18000,25]
[null,null,null,null,null,null,null,null,null,null,null,null,null,null,null,null,null,null,null,null,null,null,null,null,null,null,null,null,null,null,null,null,null,null,null,null,null,2018,124,null,31000,35]
[null,null,"Allgemeine Angaben",null,null,null,null,null,null,null,null,null,null,null,null,null,null,null,null,null,null,"Alle weißen Felder sind veränderbar und mit überschreibbaren Defaultwerten befüllt.\nTragen Sie in der ersten Kategorie \"Fahrzeugwahl\" die allgemeinen Eingaben ein und wählen Sie ein Fahrzeug, das Sie vergleichen wollen, aus. Scrollen Sie nach unten und kontrollieren Sie die Defaultwerte aus den Kategorien 2-5. Passen Sie diese Ihren individuellen Gegebenheiten an und entnehmen Sie aus den Grafiken die Ergebnisse.\n \nViel Erfolg wünscht Ihr strommobil-Team",null,null,null,null,null,null,null,null,null,null,null,null,null,null,null,2019,121,null,60000,42]
[null,null,null,"Jahreskilometerleistung:",null,null,4000,"[km/a]",null,null,null,null,null,"Betrachtungszeitraum1:",null,null,12,"[a]",null,null,null,null,null,null,null,null,null,null,null,null,null,null,null,null,null,null,null,2020,118,null,90000,48]
[null,null,null,{"$f":"IF(G8=\"privat\",\"Nutzung (Privater Investor):\",IF(G8=\"betrieblich\",\"Nutzung (Betrieb ist Investor):\",IF(G8=\"betrieblich + privat (<6000km/a):\",\"Nutzung (Betrieb ist Investor):\",\"Nutzung (Betrieb ist Investor):\")))","v":"Nutzung (Privater Investor):"},null,null,"privat",null,null,null,null,null,null,null,null,null,null,null,null,null,null,null,null,null,null,null,null,null,null,null,"Laufzeit",{"$f":"Q7","v":12},null,null,null,null,null,null,null,null,1000000,50]
[null,null,null,null,null,null,null,null,null,null,null,null,null,null,null,null,null,null,null,null,null,null,null,null,null,null,null,null,null,null,null,"Benzinfahrzeug",null,null,null,null,null,null,null,null,">1000000",55,{"$f":"IF(AL1<AO3,AP3,IF(AL1<AO4,AP4,IF(AL1<AO5,AP5,IF(AL1<AO6,AP6,IF(AL1<AO7,AP7,IF(AL1<AO8,AP8,AP9))))))","v":35}]
[null,null,"Auswahl",null,null,"Elektrofahrzeug",null,null,null,null,null,"Verbrennungs-Kfz",null,null,null,null,null,null,null,null,null,null,null,null,null,null,null,null,null,null,{"$f":"IF(VLOOKUP($G$12,'Daten-Elektrofahrzeug'!C23:M79,'Daten-Elektrofahrzeug'!K5,FALSE)=\"\",\"ja\",IF(VLOOKUP($G$12,'Daten-Elektrofahrzeug'!C23:M79,'Daten-Elektrofahrzeug'!L5,FALSE)=\"\",\"nein\",H13))","v":{"$error":"#N/A"}}]
[null,null,null,null,null,null,null,null,null,null,null,null,null,null,"*",null,null,null,null,null,null,null,null,null,null,null,null,null,null,null,"Investition",{"$f":"M29/AF8","v":4057.5},{"$f":"AF11/$AF$16","v":0.74695419417311293}]
[null,null,null,{"$f":"IF(H141=\"\",\"Neuwagen (inkl.Akku):\",\"Neuwagen:\")","v":"Neuwagen (inkl.Akku):"},null,null,"Cupra  Born",null,null,null,null,null,"VW Touran R-Line TDI - Diesel",null,null,null,null,null,null,null,null,null,null,null,null,null,null,null,null,null,"Heimladestation",{"$f":"M31/10","v":0},{"$f":"AF12/$AF$16","v":0}]
[null,null,null,"Batterie mieten oder kaufen:",null,null,"Akku kaufen!",null,null,null,null,null,null,null,null,null,null,null,null,null,null,null,null,null,null,null,null,null,null,null,"Motorbez. Versicherungssteuer",{"$f":"M47","v":509.76000000000005},{"$f":"AF13/$AF$16","v":9.3842851514894909E-2}]
[null,null,null,"Batterieleasing Laufzeit:",null,null,36,"[Monate]",null,null,null,null,null,null,null,null,null,null,null,null,null,null,null,null,null,null,null,null,null,null,"Wartung",{"$f":"M49","v":500},{"$f":"AF14/$AF$16","v":9.2046111419976942E-2}]
[null,null,"Leistungsdaten",null,null,null,null,null,null,null,null,null,null,null,null,null,null,null,null,null,null,"8. Vollkosten pro Kilometer",null,null,null,null,null,null,null,null,"Verbrauch",{"$f":"M65","v":364.8},{"$f":"AF15/$AF$16","v":6.7156842892015178E-2}]
[null,null,null,"Kraftstoff:",null,null,{"$f":"VLOOKUP($G$12,'Daten-Elektrofahrzeug'!C6:M79,'Daten-Elektrofahrzeug'!F5,FALSE)","v":"Elektrizität"},null,null,null,null,null,{"$f":"VLOOKUP($M$12,'Daten-Benzin-Dieselfahrzeug'!C6:M25,'Daten-Benzin-Dieselfahrzeug'!E5,FALSE)","v":"Diesel"},null,null,"Leistungsunterschied",null,null,null,null,null,null,null,null,null,null,null,null,null,null,null,{"$f":"SUM(AF11:AF15)","v":5432.06}]
[null,null,null,"Leistung:",null,null,{"$f":"VLOOKUP($G$12,'Daten-Elektrofahrzeug'!C6:M79,'Daten-Elektrofahrzeug'!E5,FALSE)","v":150},null,"[kW]",null,null,null,{"$f":"VLOOKUP($M$12,'Daten-Benzin-Dieselfahrzeug'!C6:M25,'Daten-Benzin-Dieselfahrzeug'!D5,FALSE)","v":90},"[kW]",null,null,{"$f":"IF(M17-G17<0,(M17-G17)*-1,M17-G17)","v":60},"[kW]"]
[null,null,null,null,null,null,{"$f":"G17*1.3596216","v":203.94324},null,"[PS]",null,null,null,{"$f":"M17*1.3596216","v":122.36594400000001},"[PS]",null,null,{"$f":"IF(M18-G18<0,(M18-G18)*-1,M18-G18)","v":81.57729599999999},"[PS]",null,null,null,null,null,null,null,null,null,null,null,null,null,"Elektrofahrzeug"]
[null,null,null,"Spezifischer Energiebedarf:",null,null,{"$f":"VLOOKUP($G$12,'Daten-Elektrofahrzeug'!C6:M79,'Daten-Elektrofahrzeug'!G5,FALSE)","v":"15,5"},null,"[kWh/100km]",null,null,null,{"$f":"VLOOKUP($M$12,'Daten-Benzin-Dieselfahrzeug'!C6:M25,'Daten-Benzin-Dieselfahrzeug'!G5,FALSE)","v":5.7},"[l/100km]"]
[null,null,null,"Ladewirkungsgrad2:",null,null,0.95,null,"[]",null,null,null,{"$f":"M19/100*$G$7","v":228},"[l/a]",null,"Energieeinsparung",null,null,null,null,null,null,null,null,null,null,null,null,null,null,"Investition (inkl. Förderung)",{"$f":"($G$29-$G$32)/$AF$8","v":4091.6666666666665},{"$f":"AF20/$AF$25","v":0.80841395231146262}]
[null,null,null,"Jahresbedarf:",null,null,{"$f":"(G19/100*$G$7)/G20","v":652.63157894736844},null,"[kWh/a]",null,null,null,{"$f":"IF(M16=\"Benzin\",M20*'Daten-Benzin-Dieselfahrzeug'!$O$3,M20*'Daten-Benzin-Dieselfahrzeug'!$O$4)","v":2304.2820000000002},"[kWh/a]",null,null,{"$f":"M21-G21","v":1651.6504210526318},"[kWh/a]",null,null,null,null,null,null,null,null,null,null,null,null,"Heimladestation",{"$f":"$G$31/$AF$8","v":100},{"$f":"AF21/$AF$25","v":1.9757571135921692E-2}]
[null,null,null,"direkte CO2-Emissionen3:",null,null,{"$f":"VLOOKUP($G$12,'Daten-Elektrofahrzeug'!C6:M79,'Daten-Elektrofahrzeug'!I5,FALSE)","v":0},null,"[g/km]",null,null,null,{"$f":"VLOOKUP($M$12,'Daten-Benzin-Dieselfahrzeug'!C6:M25,'Daten-Benzin-Dieselfahrzeug'!H5,FALSE)","v":149},"[g/km]",null,null,null,null,null,null,null,null,null,null,null,null,null,null,null,null,"Motorbez. Versicherungssteuer",{"$f":"$G$47","v":512.40000000000009},{"$f":"AF22/$AF$25","v":0.10123779450046277}]
[null,null,null,"Jährlichen direkten CO2-Emissionen:",null,null,{"$f":"G22*G7/1000","v":0},null,"[kg/a]",null,null,null,{"$f":"M22*G7/1000","v":596},"[kg/a]",null,null,null,null,null,null,null,null,null,null,null,null,null,null,null,null,"Wartung",{"$f":"$G$49","v":200},{"$f":"AF23/$AF$25","v":3.9515142271843384E-2}]
[null,null,null,null,null,null,null,null,null,null,null,null,null,null,null,null,null,null,null,null,null,null,null,null,null,null,null,null,null,null,"Verbrauch",{"$f":"$G$65","v":157.2842105263158},{"$f":"AF24/$AF$25","v":3.1075539780309681E-2}]
[null,null,null,null,null,null,null,null,null,null,null,null,null,null,null,null,null,null,null,null,null,null,null,null,null,null,null,null,null,null,null,{"$f":"SUM(AF20:AF24)","v":5061.3508771929819}]
[null,null,"2. Investitionskosten",null,null,"Elektrofahrzeug",null,null,null,null,null,"Verbrennungs-Kfz",null,null,null,"Differenz",null,null,null,null,null,"9. Vollkosten (Betrachtungszeitraum 12 Jahre)"]
[]
[null,null,null,null,null,null,"BRUTTO",null,"NETTO",null,null,null,null,null,null,null,null,null,null,null,null,"Monatliche Vollkosten"]
[null,null,null,{"$f":"IF(G8=\"Privat\",\"Privatfahrzeug:\",\"Vorsteuerabzug (Betriebsfahrzeug):\")","v":"Privatfahrzeug:"},null,null,{"$f":"VLOOKUP($G$12,'Daten-Elektrofahrzeug'!C6:M79,IF(OR(G13=H140,H141=\"\"),'Daten-Elektrofahrzeug'!L5,'Daten-Elektrofahrzeug'!J5),FALSE)","v":49100},"[€]",{"$f":"IF((G29-G32)<80000,IF((G29-G32)<=40000,(G29-G32)/1.2,(G29-G32)-(40000-(40000/1.2))),(G29-G32))","v":42433.333333333336},"[€]",null,null,{"$f":"VLOOKUP($M$12,'Daten-Benzin-Dieselfahrzeug'!C6:M25,'Daten-Benzin-Dieselfahrzeug'!I5,FALSE)","v":48690},"[€]",null,null,{"$f":"IF(G8<>C121,M29-I29,M29-G29)","v":-410},"[€]"]
[]
[null,null,null,"Heimladestation (Investition Wallbox):",null,null,1200,"[€]",{"$f":"G31*$C$129","v":1037.0672097759675},"[€]",null,null,null,null,null,null,{"$f":"IF(G8<>C121,I31*-1,G31*-1)","v":-1200},"[€]"]
[null,null,null,"Förderung (Auto + Heimladestation):",null,null,0,"[€]",null,null,null,{"$f":"IF($G$8<>$C$121,\"                Förderung ist im Nettoanschaffungswert integriert!\",\"\")","v":""},null,null,null,null,{"$f":"IF($G$8=C121,G32-M32,I32-M32)","v":0},"[€]"]
[null,null,null,null,null,null,null,null,null,null,null,null,null,null,null,null,{"$f":"SUM(Q29:Q32)","v":-1610},"[€]"]
[null,null,null,"Investitionen in den Akku erfolgen im Jahr:",null,null,9,"[a]"]
[null,null,null,"Höhe der Investition (dzt. 200€/kWh)4:",null,null,2000,"[€]",{"$f":"G35*$C$129","v":1728.4453496266126},"[€]",null,null,null,null,null,null,{"$f":"IF($G$8<>C121,I35*-1,G35*-1)","v":-2000},"[€]"]
[null,null,{"$f":"VLOOKUP($G$12,'Daten-Elektrofahrzeug'!C23:N79,'Daten-Elektrofahrzeug'!N5,FALSE)","v":{"$error":"#N/A"}},null,null,null,null,null,null,null,null,null,null,null,null,null,null,null,null,null,null,null,null,null,null,null,null,null,null,null,null,"jährliche Vollkosten",null,"monatliche Vollkosten",null,"tägliche Vollkosten"]
[null,null,null,null,null,null,null,null,null,null,null,null,null,null,null,null,null,null,null,null,null,null,null,null,null,null,null,null,null,null,null,{"$f":"F10","v":"Elektrofahrzeug"},{"$f":"L10","v":"Verbrennungs-Kfz"},{"$f":"AF37","v":"Elektrofahrzeug"},{"$f":"AG37","v":"Verbrennungs-Kfz"},{"$f":"AH37","v":"Elektrofahrzeug"},{"$f":"AI37","v":"Verbrennungs-Kfz"}]
[null,null,null,null,null,null,null,null,null,null,null,null,null,null,null,null,null,null,null,null,null,null,null,null,null,null,null,null,null,null,"Investition",{"$f":"IF(G8<>C121,((I29+I31+I35)/AF8),(G29+G31+G35-G32)/AF8)","v":4358.333333333333},{"$f":"M29/AF8","v":4057.5},{"$f":"AF38/12","v":363.1944444444444},{"$f":"AG38/12","v":338.125},{"$f":"AH38/30.4","v":11.947185672514619},{"$f":"AI38/30.4","v":11.122532894736842}]
[null,null,"3. Betriebskosten",null,null,"Elektrofahrzeug",null,null,null,null,null,"Verbrennungs-Kfz",null,null,null,"Differenz",null,null,null,null,null,"Jährliche Vollkosten",null,null,null,null,null,null,null,null,"Betriebskosten",{"$f":"IF(G8<>C121,SUM(I47:I52),SUM(G47:G52))","v":1237.2},{"$f":"SUM(M47:M52)","v":1534.56},{"$f":"AF39/12","v":103.10000000000001},{"$f":"AG39/12","v":127.88},{"$f":"AH39/30.4","v":3.3914473684210531},{"$f":"AI39/30.4","v":4.2065789473684214}]
[null,null,null,null,null,null,null,null,null,null,null,null,null,null,null,null,null,null,null,null,null,null,null,null,null,null,null,null,null,null,"Verbrauchskosten",{"$f":"IF(G8<>C121,SUM(I65+I68),SUM(G65+G68))","v":157.2842105263158},{"$f":"M65","v":364.8},13.10701754385965,30.400000000000002,0.43115189289012007,1.0000000000000002]
[null,null,null,null,null,null,"Defaultwert",null,"Individualwert"]
[null,null,null,"Dauerleistung:",null,null,{"$f":"VLOOKUP($G$12,'Daten-Elektrofahrzeug'!$C$6:$Q$79,'Daten-Elektrofahrzeug'!P5,FALSE)","v":115},"[kW]",null,"[kW]"]
[null,null,null,"Leergewicht:",null,null,{"$f":"VLOOKUP($G$12,'Daten-Elektrofahrzeug'!$C$6:$Q$79,'Daten-Elektrofahrzeug'!Q5,FALSE)","v":1840},"[kg]",null,"[kg]"]
[]
[null,null,null,null,null,null,"BRUTTO",null,"NETTO",null,null,null,null,null,null,null,null,null,null,null,null,null,null,null,null,null,null,null,null,null,"Summe:",{"$f":"SUM(AF38:AF40)","v":5752.817543859649},5956.86,479.40146198830405,496.40499999999997,15.769784933825793,16.329111842105263]
[null,null,"jährliche","Zahlungsweise der motorbez.",null,null,null,null,null,null,null,null,null,null,null,null,null,null,null,null,null,null,null,null,null,null,null,null,null,null,"Vollkosten [€/km]",{"$f":"AF45/$G$7","v":1.4382043859649123},{"$f":"AG45/$G$7","v":1.489215}]
[null,null,null,"Versicherungssteuer:",null,null,{"$f":"Berechnungen!V5","v":512.40000000000009},"[€/a]",0,"[€/a]",null,null,{"$f":"'Motorbez. Versicherungssteuer'!E2","v":509.76000000000005},"[€/a]",null,null,{"$f":"M47-G47","v":-2.6400000000000432},"[€]",null,null,null,null,null,null,null,null,null,null,null,null,"Verbauchskosten [€/km]",{"$f":"AF40/$G$7*100","v":3.932105263157895},{"$f":"AG40/$G$7*100","v":9.120000000000001}]
[null,null,null,"Versicherungsprämie (exkl. motorb. Vers.):",null,null,300,"[€/a]",{"$f":"G48","v":300},"[€/a]",null,null,300,"[€/a]",null,null,{"$f":"IF($G$8<>C121,M48-I48,M48-G48)","v":0},"[€]"]
[null,null,0.6,{"$f":"\"Wartungseinsparung(\"&C49*100&\"%):\"","v":"Wartungseinsparung(60%):"},null,null,{"$f":"M49*(1-C49)","v":200},"[€/a]",{"$f":"G49*$C$129","v":172.84453496266124},"[€/a]",null,null,500,"[€/a]",null,null,{"$f":"IF($G$8<>C121,M49-I49,M49-G49)","v":300},"[€]"]
[null,null,null,"Mitgliedsbeitrag Autofahrerclub:",null,null,121,"[€/a]",104.57094365241007,"[€/a]",null,null,121,"[€/a]",null,null,{"$f":"IF($G$8<>C121,M50-I50,M50-G50)","v":0},"[€]"]
[null,null,null,"Vignette/Umweltplakette...:",null,null,103.8,"[€/a]",89.706313645621194,"[€/a]",null,null,103.8,"[€/a]",null,null,{"$f":"IF($G$8<>C121,M51-I51,M51-G51)","v":0},"[€]"]
[null,null,0.3,"Lohnnebenkosten Sachbezug:5",null,null,0,"[€/a]",0,"[€/a]",null,null,{"$f":"IF(OR(G8=C121,G8=C122),0,IF(G8=C123,(VLOOKUP($M$12,'Daten-Benzin-Dieselfahrzeug'!C6:O25,'Daten-Benzin-Dieselfahrzeug'!K5,FALSE))*6,(VLOOKUP($M$12,'Daten-Benzin-Dieselfahrzeug'!C6:O25,'Daten-Benzin-Dieselfahrzeug'!K5,FALSE))*12))","v":0},"[€/a]",null,null,{"$f":"IF($G$8<>C121,M52-I52,M52-G52)","v":0},"[€]"]
[null,null,null,{"$f":"IF(OR(C121=G8,C122=G8),\"\",\"(Arbeitnehmervorteile bleiben unberücksichtigt!)\")","v":""},null,null,null,null,null,null,null,null,null,null,null,null,{"$f":"SUM(Q47:Q52)","v":297.35999999999996},"[€]"]
[]
[]
[null,null,"4. Verbrauchskosten",null,null,"Elektrofahrzeug",null,null,null,null,null,"Verbrennungs-Kfz",null,null,null,"Differenz",null,null,null,null,null,"10. Übersicht über die jährlichen Ersparnisse (Barwerte)"]
[]
[null,null,"Energieträger",null,null,null,"BRUTTO",null,"NETTO"]
[null,null,null,"Ladung an der Heimladestation:",null,null,0.9]
[null,null,null,"Tarif Heimladestation:",null,null,19,"[c/kWh]",{"$f":"G60*$C$129","v":16.420230821452819},"[c/kWh]"]
[null,null,null,"Tarif Tankstellen:",null,null,70,"[c/kWh]",{"$f":"G61*$C$129","v":60.495587236931442},"[c/kWh]",null,null,null,null,null,null,null,null,null,null,null,null,null,null,null,null,null,null,null,null,null,null,"<=24",">24-91",">92-111",">111"]
[null,null,null,"Mischtarif Heimladung/öffentliche Ladung:",null,null,{"$f":"G60*$G$59+G61*(1-$G$59)","v":24.1},"[c/kWh]",{"$f":"I60*$G$59+I61*(1-$G$59)","v":20.827766463000682},"[c/kWh]",null,null,null,null,null,null,null,null,null,null,null,null,null,null,null,null,null,null,null,null,null,"jährliche",0,0.62,0.66,0.75]
[null,null,null,null,null,null,null,null,null,null,null,null,null,null,null,null,null,null,null,null,null,null,null,null,null,null,null,null,null,null,null,"½-jährliche",0,0.65720000000000001,0.6996,0.79500000000000004]
[null,null,null,"Kraftstoffpreise:",null,null,null,null,null,null,null,null,1.6,"[€/l]",null,null,null,null,null,null,null,null,null,null,null,null,null,null,null,null,null,"¼-jährliche",0,0.66959999999999997,0.71279999999999999,0.81]
[null,null,null,"Kraftstoffkosten:",null,null,{"$f":"$G$21*G62/100","v":157.2842105263158},"[€/a]",{"$f":"$G$21*I62/100","v":135.92858112695183},"[€/a]",null,null,{"$f":"M20*M64","v":364.8},"[€/a]",null,null,{"$f":"IF($G$8<>C121,M65-I65,M65-G65)","v":207.51578947368421},"[€]",null,null,null,null,null,null,null,null,null,null,null,null,null,"monatliche",0,0.68200000000000005,0.72599999999999998,0.82499999999999996]
[null,null,"Sonstiges"]
[null,null,null,"Batteriemiete:",null,null,{"$f":"G68/12","v":0},"[€/m]",{"$f":"G67*$C$129","v":0},"[€/m]"]
[null,null,null,null,null,null,{"$f":"IF(G8=\"betrieblich\",((VLOOKUP($G$12,'Daten-Elektrofahrzeug'!C6:M79,IF(OR(G13=H140,H141=\"\"),'Daten-Elektrofahrzeug'!M5,'Daten-Elektrofahrzeug'!K5),FALSE))*12),((VLOOKUP($G$12,'Daten-Elektrofahrzeug'!C6:M79,IF(OR(G13=H140,H141=\"\"),'Daten-Elektrofahrzeug'!M5,'Daten-Elektrofahrzeug'!K5),FALSE))*12))","v":0},"[€/a]",{"$f":"G68*$C$129","v":0},"[€/a]",null,null,null,null,null,null,{"$f":"IF(G8=C122,I68*-1,G68*-1)","v":0},"[€]"]
[null,null,null,null,null,null,null,null,null,null,null,null,null,null,null,null,{"$f":"Q65+Q68","v":207.51578947368421},"[€]"]
[]
[]
[null,"5. Wirtschaftliche Entwicklung",null,null,null,null,null,null,null,null,null,null,null,null,null,null,null,null,null,null,null,"11. Übersicht Rentabilität (Kapitalwerteverlauf)"]
[]
[null,null,null,"Inflationsrate/Jahr:",null,null,1.9,"[%]"]
[null,null,null,"Strompreissteigerung/Jahr:",null,null,1.5,"[%]"]
[null,null,null,"Spritpreissteigerung/Jahr:",null,null,2,"[%]"]
[null,null,null,"Kalkulationszinssatz:",null,null,1.5,"[%]"]
[]
[]
[null,null,"6. Zusammenfassung"]
[]
[null,null,"Energie"]
[null,null,null,"Energieeinsparungen pro Jahr:",null,null,{"$f":"Q21","v":1651.6504210526318},"[kWh/a]"]
[null,null,null,"Eingesparte Energie nach 12 Jahren:",null,null,{"$f":"G83*$Q$7","v":19819.805052631582},"[kWh]"]
[null,null,"CO2"]
[null,null,null,"CO2-Einsparungen pro Jahr:",null,null,{"$f":"M23","v":596},"[kg CO2/a]"]
[null,null,null,"CO2-Einsparungen nach 12 Jahren:",null,null,{"$f":"(M23*$Q$7)","v":7152},"[kg CO2]"]
[null,null,"Rentabilität"]
[null,null,null,"Mehreinnahmen nach 12 Jahren:",null,null,{"$f":"Berechnungen!$I$21","v":2129.2401779240672},"[€]"]
[null,null,null,"Amortisationsdauer:",null,null,{"$f":"Berechnungen!H18","v":4},"[Jahre]"]
[]
[]
[null,null,"Rechtliche Information:"]
[null,null,null,"Wir möchten darauf hinweisen, dass sich dieses Programm in stetiger Entwicklung befindet und wir die Nutzer bitten, im Falle eines auftretenden Fehlers folgende Person zu kontaktieren, um diese zu korrigieren:"]
[null,null,null,"Kontakt:",null,null,"DI (FH) Franz Jetzinger"]
[null,null,null,null,null,null,"f.jetzinger@linzag.at"]
[null,null,null,"Die LINZ AG sowie alle Mitwirkenden an diesem Programm haben deren Inhalte sorgfältig recherchiert und erstellt. Fehler können dennoch nicht gänzlich ausgeschlossen werden.\nDie Genannten übernehmen daher keine Haftung für die Richtigkeit, Vollständigkeit und Aktualität der Inhalte, insbesondere übernehmen sie keinerlei Haftung für eventuelle unmittelbare oder mittelbare Schäden, die durch direkte oder indirekte Nutzung des angebotenen Programms entstehen."]
[null,null,"Annahmen:"]
[null,null,1,"Das Fahrzeug wird nach 12 Jahren außer Betrieb gesetzt wird (Restwert = 0)."]
[null,null,2,"Der Ladewirkungsgrad Li-Ion mit 0,95 angenommen."]
[null,null,3,"Das Fahrzeug wird zu 100% mit Ökostrom betrieben (direkte CO2-Emissionen eines Elektroautos liegen bei Versorgung mittels Ökostrom bei 0g CO2/km)."]
[null,null,4,"Dieses Feld bietet die Möglichkeit eine Akku-Reinvestition einzugeben - die Kosten liegen dzt. bei 200€/kWh."]
[null,null,5,"Für Kraftfahrzeuge mit einem CO2-Emmissionswert von 0g/km gilt seit dem Kalenderjahr 2016 ein Sachbezugswert von Null."]
[null,null,"*","Die angeführten Verbrennungskraftfahrzeuge sind nicht vorsteuerabzugsfähig!"]
[null,null,"Quellen:"]
[null,null,null,"https://www.topprodukte.at"]
[null,null,null,"Recknagel, Sprenger, Schramek; Taschenbuch für Heizung + Klimatechnik; 2001; Seite 209"]
[]
[null,null,"Die derzeit aktuelle Version:"]
[null,null,null,"E_MOB_Rechner_0325_Vers.7.2"]
[]
[]
[]
[]
[]
[]
[]
[]
[]
[]
[null,null,"privat"]
[null,null,"betrieblich"]
[null,null,"betrieblich + privat (<6000km/a)"]
[null,null,"betrieblich + privat (>6000km/a)"]
[]
[]
[]
[null,null,"Prozentsatz mit dem die Vorsteuer bei den Verbrauchs- und Betriebskosten abgezogen werden darf"]
[null,null,{"$f":"I29/(G29-G32)","v":0.86422267481330628}]
[]
[]
[]
[]
[]
[]
[]
[]
[]
[]
[null,null,{"$f":"VLOOKUP($G$12,'Daten-Elektrofahrzeug'!C6:M79,'Daten-Elektrofahrzeug'!K5,FALSE)","v":0},{"$f":"IF(C140=0,\"Hersteller bietet keine Akku-Mietvariante!\",\"Akkumietvariante möglich\")","v":"Hersteller bietet keine Akku-Mietvariante!"},null,null,null,{"$f":"D141","v":"Akku kaufen!"}]
[null,null,null,"Akku kaufen!",null,null,null,{"$f":"IF(D140=\"Hersteller bietet keine Akku-Mietvariante!\",\"\",D142)","v":""}]
[null,null,null,"Akku mieten!"]
[]
[]
[]
[]
[null,null,"ja",null,null,null,12]
[null,null,"nein",null,null,null,24]
[null,null,null,null,null,null,36]

{"sheet":"Daten-Elektrofahrzeug","index":3,"n_rows":77,"n_cols":49,"rows_kept":77,"cut":false,"hidden":false,"merged":[[0,0,0,2],[2,6,2,7],[2,9,2,10],[2,11,2,12],[1,6,1,7],[1,0,1,2]]}
["Allgemeine Daten Elektrofahrzeuge",null,null,null,null,null,null,null,null,null,null,null,null,null,null,null,null,null,null,null,null,null,null,null,null,null,null,null,null,null,null,null,"Batteriemiete und Berechnung \"Nissan Leaf\"",null,null,null,null,null,null,null,null,"Batteriemiete und Berechnung \"Renault Zoe R90 - Standard\""]
["https://www.topprodukte.at",null,null,null,null,null,"Stromverbrauch",null,"CO2-Emissionen",null,null,null,null,null,null,null,null,null,null,null,null,null,null,null,null,null,null,null,null,null,{"$f":"VLOOKUP(AF2,AG2:AL5,IF(#REF!+1<=1,6,#REF!+1),TRUE)","v":{"$error":"#REF!"}},{"$f":"IF(Eingabe!G14<='Daten-Elektrofahrzeug'!AG3,'Daten-Elektrofahrzeug'!AG3,IF(Eingabe!G14<='Daten-Elektrofahrzeug'!AG4,'Daten-Elektrofahrzeug'!AG4,'Daten-Elektrofahrzeug'!AG5))","v":36},"Vertragslaufzeit",12500,15000,17500,20000,25000,null,{"$f":"VLOOKUP(AO2,AP2:AW5,IF(#REF!+1<=1,8,#REF!+1),TRUE)","v":{"$error":"#REF!"}},{"$f":"IF(Eingabe!$G$14<='Daten-Elektrofahrzeug'!AP3,'Daten-Elektrofahrzeug'!AP3,IF(Eingabe!$G$14<='Daten-Elektrofahrzeug'!AP4,'Daten-Elektrofahrzeug'!AP4,'Daten-Elektrofahrzeug'!AP5))","v":36},"Vertragslaufzeit",7500,10000,12500,15000,17500,20000,20200]
["Marke","Modell","Modellauswahl","Typ","Leistung (max.)","Kraftstoff","kombiniert",null,"kombiniert","Preis bei Batteriemiete",null,"Preis bei Batteriekauf",null,"Anmerkung Garantie",null,"Leistung (dauer)","Leergewicht",null,null,null,null,null,null,null,null,null,null,null,null,null,null,null,12,99,106,114,122,142,null,null,null,12,59,69,79,89,99,109,{"$f":"IF(Eingabe!$G$8=\"privat\",119,109)","v":119}]
[null,null,null,null,"[kW]",4,"kWh/100km","l/100km","[g/km]","[€]","[€/Monat]","[€]","[€/Monat]","(Abweichungen vorbehalten)",null,"[kW]","[kg]",null,null,null,null,null,null,null,null,null,null,null,null,null,null,null,24,89,96,104,112,132,null,null,null,24,59,69,79,89,99,109,{"$f":"IF(Eingabe!$G$8=\"privat\",119,109)","v":119}]
[null,null,1,2,3,4,5,6,7,8,9,10,11,12,null,14,15,null,null,null,null,null,null,null,null,null,null,null,null,null,null,null,36,79,86,94,102,122,null,null,null,36,59,69,79,89,99,109,{"$f":"IF(Eingabe!$G$8=\"privat\",119,109)","v":119}]
["eigenes","Fahrzeug",{"$f":"CONCATENATE(A6,\" \",B6)","v":"eigenes Fahrzeug"},"EV",null,"Elektrizität",null,null,0]
["eigenes","Fahrzeug",{"$f":"CONCATENATE(A7,\" \",B7)","v":"eigenes Fahrzeug"},"EV",null,"Elektrizität",null,null,0]
["eigenes","Fahrzeug","eigenes Fahrzeug","EV",null,"Elektrizität",null,null,0]
["Audi","e-tron (50 quattro)",{"$f":"CONCATENATE(A9,\" \",B9)","v":"Audi e-tron (50 quattro)"},"EV",230,"Elektrizität",23.6,null,0,null,null,69100,null,"Akkugarantie: 8 Jahre oder bis 160.000 km",null,158,2140,null,"Test: Audi e-tron Sportback 50 quattro - ALLES AUTO"]
["Audi ","Q4 45 e-tron",{"$f":"CONCATENATE(A10,\" \",B10)","v":"Audi  Q4 45 e-tron"},"EV",210,"Elektrizität","16,9",null,0,null,null,54863,null,"Akkugarantie: 8 Jahre oder bis 160.000 km",null,77,2145,null,"Audi Q4 Sportback e-tron 45 quattro: Technische Daten"]
["BMW ","iX1 eDrive20","BMW  iX1 eDrive20","EV",150,"Elektrizität","16,8",null,0,null,null,52968,null,"Akkugarantie: 8 Jahre oder bis 160.000 km",null,104,1940,null,"BMW iX1 SUV (U11): Technische Daten & Motorisierungen"]
["BMW ","iX2 eDrive20",{"$f":"CONCATENATE(A12,\" \",B12)","v":"BMW  iX2 eDrive20"},"EV",150,"Elektrizität","16,4",null,0,null,null,64328,null,"Akkugarantie: 8 Jahre oder bis 160.000 km",null,68,1960,null,"BMW iX2 (U10): Motoren & technische Daten"]
["BYD ","ATTO 3","BYD  ATTO 3","EV",150,"Elektrizität","15,6",null,0,null,null,46620,null,"Akkugarantie: 8 Jahre oder bis 160.000 km",null,65,1750,null,"Großer Test BYD Atto 3 Design - ALLES AUTO"]
["Citroen ","e C4","Citroen  e C4","EV",100,"Elektrizität","15,1",null,0,null,null,46580,null,"Akkugarantie: 8 Jahre oder bis 160.000 km",null,62,1636,null,"Citroen e-C4 Electric Elektromotor 156: Technische Daten"]
["Citroen ","e-Berlingo","Citroen  e-Berlingo","EV",100,"Elektrizität","19,3",null,0,null,null,56260,null,"Akkugarantie: 8 Jahre oder bis 160.000 km",null,57,1811]
["Citroen ","e-SpaceTourer","Citroen  e-SpaceTourer","EV",100,"Elektrizität","25,5",null,0,null,null,70190,null,"Akkugarantie: 8 Jahre oder bis 160.000 km",null,57,2027,null,"Citroen e-Spacetourer: Technische Daten & Datenblatt"]
["Cupra ","Born","Cupra  Born","EV",150,"Elektrizität","15,5",null,0,null,null,49100,null,"Akkugarantie: 8 Jahre oder bis 160.000 km",null,115,1840,null,"CUPRA Born VZ (2024-2025) Preise und technische Daten - EV Database"]
["Fiat ","500e","Fiat  500e","EV",70,"Elektrizität","13,0",null,0,null,null,35190,null,"Akkugarantie: 8 Jahre oder bis 160.000 km",null,58,1330,null,"Fiat 500 (2020) – Wikipedia"]
["Fiat ","600e","Fiat  600e","EV",115,"Elektrizität","15,1",null,0,null,null,31030,null,"Akkugarantie: 8 Jahre oder bis 160.000 km",null,84,1595,null,"Großer Test Fiat 600e La Prima - ALLES AUTO"]
["Fiat ","e-Doblo","Fiat  e-Doblo","EV",101,"Elektrizität","19,3",null,0,null,null,38100,null,"Akkugarantie: 8 Jahre oder bis 160.000 km",null,57,1881,null,"Fiat E-Doblò L1 (11/22 - 12/23): Technische Daten, Bilder, Preise | ADAC"]
["Fiat ","Ulysse","Fiat  Ulysse","EV",100,"Elektrizität","27,6",null,0,null,null,70940,null,"Akkugarantie: 8 Jahre oder bis 160.000 km",null,57,2140,null,"Fiat E-Ulysse im Test: Langer E-Transporter für Shuttlezwecke"]
["Ford ","Explorer","Ford  Explorer","EV",125,"Elektrizität","18,6",null,0,null,null,56330,null,"Akkugarantie: 8 Jahre oder bis 160.000 km",null,70,1908,null,"Explorer 25.50 Pan Euro Localized - DE AT.xlsx"]
["Ford ","Mustang Mach-E","Ford  Mustang Mach-E","EV",198,"Elektrizität","17,2",null,0,null,null,63780,null,"Akkugarantie: 8 Jahre oder bis 160.000 km","2017 ok",154,2197]
["Hyundai ","IONIQ 5","Hyundai  IONIQ 5","EV",125,"Elektrizität","16,7",null,0,null,null,51170,null,"Akkugarantie: 8 Jahre oder bis 160.000 km",null,42,1955,null,"Hyundai Ioniq 5 - e-move"]
["Hyundai ","IONIQ 6","Hyundai  IONIQ 6","EV",111,"Elektrizität","13,9",null,0,null,null,57250,null,"Akkugarantie: 8 Jahre oder bis 160.000 km",null,37,1775,null,"Hyundai Ioniq 6 - e-move"]
["Kia ","EV6","Kia  EV6","EV",125,"Elektrizität","16,6",null,0,null,null,54630,null,"Akkugarantie: 7 Jahre oder bis 150.000 km","2017 ok",42,2035,null,"Kia EV6 - e-move"]
["Mercedes ","EQA 250","Mercedes  EQA 250","EV",140,"Elektrizität","17,9",null,0,null,null,57150,null,"Akkugarantie: 8 Jahre oder bis 160.000 km",null,111,2055,null,"Mercedes-Benz EQA 250: Technische Daten & Datenblatt"]
["Mercedes ","EQB 250","Mercedes  EQB 250","EV",140,"Elektrizität","16,6",null,0,null,null,60430,null,"Akkugarantie: 8 Jahre oder bis 160.000 km",null,111,2105]
["Mercedes ","EQB 350","Mercedes  EQB 350","EV",215,"Elektrizität",19.2,null,0,null,null,60630,null,"Akkugarantie: 8 Jahre oder bis 160.000 km",null,139,2170]
["Mercedes ","EQE 300","Mercedes  EQE 300","EV",180,"Elektrizität","17,0",null,0,null,null,66560,null,"Akkugarantie: 8 Jahre oder bis 160.000 km",null,109,2375]
["Mercedes ","EQT","Mercedes  EQT","EV",90,"Elektrizität","19,4",null,0,null,null,59888,null,"Akkugarantie: 8 Jahre oder bis 160.000 km",null,51,2200]
["Mercedes ","EQV 300","Mercedes  EQV 300","EV",150,"Elektrizität","27,9",null,0,null,null,95292,null,"Akkugarantie: 8 Jahre oder bis 160.000 km",null,95,2891]
["Mini ","Aceman","Mini  Aceman","EV",135,"Elektrizität","16,7",null,0,null,null,59102,null,"Akkugarantie: 8 Jahre oder bis 160.000 km",null,55,1720]
["Mini ","Cooper SE","Mini  Cooper SE","EV",160,"Elektrizität","14,7",null,0,null,null,34200,null,"Akkugarantie: 8 Jahre oder bis 160.000 km",null,75,1680]
["Mini ","Countryman E","Mini  Countryman E","EV",150,"Elektrizität","17,0",null,0,null,null,56300,null,"Akkugarantie: 8 Jahre oder bis 160.000 km",null,104,1940]
["Renault ","5 E-Tech","Renault  5 E-Tech","EV",110,"Elektrizität","16,3",null,0,null,null,38810,null,"Akkugarantie: 8 Jahre oder bis 160.000 km",null,78,1542]
["Renault ","Scenic E-Tech","Renault  Scenic E-Tech","EV",125,"Elektrizität","17,6",null,0,null,null,48930,null,"Akkugarantie: 8 Jahre oder bis 160.000 km",null,55,1822]
["Skoda ","Enyaq 85","Skoda  Enyaq 85","EV",210,"Elektrizität","16,1",null,0,null,null,50350,null,"Akkugarantie: 8 Jahre oder bis 160.000 km",null,77,2141]
["Smart ","Pure","Smart  Pure","EV",200,"Elektrizität","18,8",null,0,null,null,43720,null,"Akkugarantie: 8 Jahre oder bis 160.000 km",null,75,1780]
["Smart ","Pure+","Smart  Pure+","EV",200,"Elektrizität","18,5",null,0,null,null,48600,null,"Akkugarantie: 8 Jahre oder bis 160.000 km",null,75,1788]
["Tesla ","Model 3 Standard ","Tesla  Model 3 Standard ","EV",235,"Elektrizität","15,1",null,0,null,null,50010,null,"Akkugarantie: 8 Jahre oder bis 160.000 km",null,88,1899]
["Volkswagen ","ID. Buzz","Volkswagen  ID. Buzz","EV",125,"Elektrizität","21,7",null,0,null,null,62943,null,"Akkugarantie: 8 Jahre oder bis 160.000 km",null,70,2400]
["Volkswagen ","ID.3","Volkswagen  ID.3","EV",125,"Elektrizität","13,8",null,0,null,null,39910,null,"Akkugarantie: 8 Jahre oder bis 160.000 km",null,70,1787]
["Volkswagen ","ID.4","Volkswagen  ID.4","EV",125,"Elektrizität","16,3",null,0,null,null,48410,null,"Akkugarantie: 8 Jahre oder bis 160.000 km",null,70,1987]
["Volkswagen ","ID.5","Volkswagen  ID.5","EV",210,"Elektrizität","17,1",null,0,null,null,58030,null,"Akkugarantie: 8 Jahre oder bis 160.000 km",null,89,2143]
[]
[null,null,null,null,null,null,null,null,null,null,null,"Leergewichte von",null,"Magazin - elektro auto mobil - Jan2025.pdf","2017 ok"]
[null,null,null,null,null,null,null,null,null,null,null,"Akkugarantien von ",null,"Elektroauto-Batterie: Lebensdauer, Garantie, Reparatur | ADAC"]
[]
[null,null,null,null,null,null,null,null,null,null,null,null,null,null,"2017 ok"]
[]
[]
[]
[]
[]
[]
[]
[]
[]
[]
[]
[null,null,null,null,null,null,null,null,null,null,null,null,null,null,"2017 ok"]
[null,null,null,null,null,null,null,null,null,null,null,null,null,null,"2017 ok"]
[null,null,null,null,null,null,null,null,null,null,null,null,null,null,"2017 ok"]
[null,null,null,null,null,null,null,null,null,null,null,null,null,null,"2017 ok"]
[null,null,null,null,null,null,null,null,null,null,null,null,null,null,"2017 ok"]
[null,null,null,null,null,null,null,null,null,null,null,null,null,null,"2017 ok"]
[null,null,null,null,null,null,null,null,null,null,null,null,null,null,"2017 ok"]
[null,null,null,null,null,null,null,null,null,null,null,null,null,null,"2017 ok"]
[null,null,null,null,null,null,null,null,null,null,null,null,null,null,"2017 ok"]
[null,null,null,null,null,null,null,null,null,null,null,null,null,null,"2017 ok"]
[]
[null,null,null,null,null,null,null,null,null,null,null,null,null,null,"2017 ok"]
[null,null,null,null,null,null,null,null,null,null,null,null,null,null,"2017 ok"]
[null,null,null,null,null,null,null,null,null,null,null,null,null,null,"2017 ok"]
[null,null,null,null,null,null,null,null,null,null,null,null,null,null,"2017 ok"]
[null,null,null,null,null,null,null,null,null,null,null,null,null,null,"2017 ok"]

{"sheet":"Daten-Benzin-Dieselfahrzeug","index":4,"n_rows":462,"n_cols":35,"rows_kept":462,"cut":false,"hidden":false,"merged":[[2,18,2,19],[3,18,3,19],[2,5,2,6],[1,5,1,6],[0,0,0,2],[1,0,1,2],[2,13,3,13]]}
["Allgemeine Daten Verbrennungskraftfahrzeuge"]
["https://www.topprodukte.at",null,null,null,null,"Kraftstoffverbrauch",null,"CO2-Emissionen"]
["Marke","Modell","Modellauswahl","Leistung","Kraftstoff","kombiniert",null,"kombiniert","Preis","Sachbezug","Lohnnebenkosten","Quelle",null,"* Energieinhalt:",{"$f":"O8*0.72/3600","v":8.5399999999999991},"kWh/liter Benzin",null,null,"Anschaffungsjahr:",null,2025,null,null,"Jahr der Anschaffung","CO2 Grenzwert"]
[null,null,null,"[kW]",null,"kWh/100km*","l/100km","[g/km]","[€]","[€/m]","[€/m]",null,null,null,{"$f":"O9*0.87/3600","v":10.1065},"kWh/liter Diesel",null,null,"CO2 Grenzwert:",null,{"$f":"VLOOKUP(U3,X5:Y12,2,TRUE)","v":126},"[g/km]",null,"[a]","[g/km]"]
[null,null,1,2,3,4,5,6,7,8,9,null,null,null,null,null,null,null,null,null,null,null,null,2016,130,"(NEFZ-Wert)"]
["Eingabe","eigenes Fahrzeug",{"$f":"CONCATENATE(A6,\" \",B6,\" - \",E6)","v":"Eingabe eigenes Fahrzeug - "},null,null,null,null,null,null,{"$f":"IF(H6>$U$4,IF(I6*0.02>960,960,I6*0.02),IF(H6>0,IF(I6*0.015>720,720,I6*0.015),0))","v":0},{"$f":"J6*Eingabe!$C$52","v":0},null,null,null,null,null,null,null,null,null,null,null,null,2017,127,"(NEFZ-Wert)"]
["Eingabe","eigenes Fahrzeug",{"$f":"CONCATENATE(A7,\" \",B7,\" - \",E7)","v":"Eingabe eigenes Fahrzeug - "},null,null,null,null,null,null,{"$f":"IF(H7>$U$4,IF(I7*0.02>960,960,I7*0.02),IF(H7>0,IF(I7*0.015>720,720,I7*0.015),0))","v":0},{"$f":"J7*Eingabe!$C$52","v":0},null,null,null,null,null,null,null,null,null,null,null,null,2018,124,"(NEFZ-Wert)"]
["Eingabe","eigenes Fahrzeug","Eingabe eigenes Fahrzeug - ",null,null,null,null,null,null,{"$f":"IF(H8>$U$4,IF(I8*0.02>960,960,I8*0.02),IF(H8>0,IF(I8*0.015>720,720,I8*0.015),0))","v":0},{"$f":"J8*Eingabe!$C$52","v":0},null,null,"Hu Benzin(Mittelwert) =",42700,"kJ/kg",null,"Benzin",null,null,null,null,null,2019,121,"(NEFZ-Wert)"]
[{"$f":"'topprodukte-benzin-diesel'!A2","v":"Audi"},"A1 SB 25 TFSI","Audi A1 SB 25 TFSI - Benzin",{"$f":"'topprodukte-benzin-diesel'!O2","v":70},"Benzin",{"$f":"IF(E9=\"Benzin\",$O$3*G9,$O$4*G9)","v":44.407999999999994},5.2,118,26433,{"$f":"IF(H9>$U$4,IF(I9*0.02>960,960,I9*0.02),IF(H9>0,IF(I9*0.015>720,720,I9*0.015),0))","v":396.495},{"$f":"J9*Eingabe!$C$52","v":118.9485},"https://www.audi.at/a1/a1-sportback/faszination",null,"Hu Gasöl (Diesel) =",41820,"kJ/kg",null,"Diesel",null,null,null,null,null,"bis März 2020",118,"(NEFZ-Wert)"]
[{"$f":"'topprodukte-benzin-diesel'!A5","v":"Audi"},"A3 SB 30 TFSI",{"$f":"CONCATENATE(A10,\" \",B10,\" - \",E10)","v":"Audi A3 SB 30 TFSI - Benzin"},{"$f":"'topprodukte-benzin-diesel'!O5","v":85},"Benzin",{"$f":"IF(E10=\"Benzin\",$O$3*G10,$O$4*G10)","v":46.97},5.5,126,30907,{"$f":"IF(H10>$U$4,IF(I10*0.02>960,960,I10*0.02),IF(H10>0,IF(I10*0.015>720,720,I10*0.015),0))","v":463.60499999999996},{"$f":"J10*Eingabe!$C$52","v":139.08149999999998},"https://www.audi.at/a3/a3-sportback/faszination",null,null,null,null,null,null,null,null,null,null,null,"ab April 2020",141,"(WLTP-Wert)"]
[{"$f":"'topprodukte-benzin-diesel'!A8","v":"BMW"},"1er Limousine 118d","BMW 1er Limousine 118d - Diesel",110,"Diesel",{"$f":"IF(E11=\"Benzin\",$O$3*G11,$O$4*G11)","v":47.500550000000004},4.7,122,39277,{"$f":"IF(H11>$U$4,IF(I11*0.02>960,960,I11*0.02),IF(H11>0,IF(I11*0.015>720,720,I11*0.015),0))","v":589.15499999999997},{"$f":"J11*Eingabe!$C$52","v":176.7465},"https://www.bmw.at/de/bmw-modelle-vergleichen.html/",null,null,null,null,null,null,null,null,null,null,null,2023,132,"(WLTP-Wert)"]
[{"$f":"'topprodukte-benzin-diesel'!A13","v":"BMW"},"3er Limousine 320d","BMW 3er Limousine 320d - Diesel",140,"Diesel",{"$f":"IF(E12=\"Benzin\",$O$3*G12,$O$4*G12)","v":53.564450000000001},5.3,139,62370,960,{"$f":"J12*Eingabe!$C$52","v":288},"https://www.bmw.at/de-at/sl/stocklocator",null,null,null,null,null,null,null,null,null,null,null,2025,126,"(WLTP-Wert)"]
[{"$f":"'topprodukte-benzin-diesel'!A14","v":"BMW"},"2er Active Tourer 216i","BMW 2er Active Tourer 216i - Benzin",90,"Benzin",53.801999999999992,6.3,143,49401,960,{"$f":"J13*Eingabe!$C$52","v":288},"https://www.bmw.at/de-at/sl/stocklocator"]
[{"$f":"'topprodukte-benzin-diesel'!A47","v":"Ford"},"Focus Titanium","Ford Focus Titanium - Diesel",125,"Diesel",{"$f":"IF(E14=\"Benzin\",$O$3*G14,$O$4*G14)","v":49.521850000000008},4.9000000000000004,128,34683,{"$f":"IF(H14>$U$4,IF(I14*0.02>960,960,I14*0.02),IF(H14>0,IF(I14*0.015>720,720,I14*0.015),0))","v":693.66},{"$f":"J14*Eingabe!$C$52","v":208.09799999999998},"https://www.ford.at/shop/build-your-ford"]
[{"$f":"'topprodukte-benzin-diesel'!A89","v":"Mercedes"},"A-Klasse 180d",{"$f":"CONCATENATE(A15,\" \",B15,\" - \",E15)","v":"Mercedes A-Klasse 180d - Diesel"},86,{"$f":"'topprodukte-benzin-diesel'!J89","v":"Diesel"},{"$f":"IF(E15=\"Benzin\",$O$3*G15,$O$4*G15)","v":51.543149999999997},5.0999999999999996,134,40847,816.94,{"$f":"J15*Eingabe!$C$52","v":245.08199999999999},"https://www.mercedes-benz.at/passengercars/buy/new-car"]
[{"$f":"'topprodukte-benzin-diesel'!A157","v":"Skoda"},"Superb TDI DSG",{"$f":"CONCATENATE(A16,\" \",B16,\" - \",E16)","v":"Skoda Superb TDI DSG - Diesel"},{"$f":"'topprodukte-benzin-diesel'!O157","v":110},"Diesel",{"$f":"IF(E16=\"Benzin\",$O$3*G16,$O$4*G16)","v":57.607050000000008},5.7,149,49590,{"$f":"IF(H16>$U$4,IF(I16*0.02>960,960,I16*0.02),IF(H16>0,IF(I16*0.015>720,720,I16*0.015),0))","v":960},{"$f":"J16*Eingabe!$C$52","v":288},"https://konfigurator.skoda.at/cc-at/de_AT_SKODA"]
[{"$f":"'topprodukte-benzin-diesel'!A171","v":"VW"},"Golf 4Me TSI","VW Golf 4Me TSI - Benzin",85,"Benzin",43.553999999999995,5.0999999999999996,135,25490,509.8,{"$f":"J17*Eingabe!$C$52","v":152.94},"https://konfigurator.volkswagen.at/cc-at/de_AT_VW22/"]
[{"$f":"'topprodukte-benzin-diesel'!A176","v":"VW"},"Golf Friends TSI","VW Golf Friends TSI - Benzin",142,"Benzin",63.195999999999998,7.4,194,{"$f":"'topprodukte-benzin-diesel'!F176","v":29390},587.80000000000007,{"$f":"J18*Eingabe!$C$52","v":176.34},"https://konfigurator.volkswagen.at/cc-at/de_AT_VW22/"]
[{"$f":"'topprodukte-benzin-diesel'!A178","v":"VW"},"Touran R-Line TDI",{"$f":"CONCATENATE(A19,\" \",B19,\" - \",E19)","v":"VW Touran R-Line TDI - Diesel"},90,"Diesel",{"$f":"IF(E19=\"Benzin\",$O$3*G19,$O$4*G19)","v":57.607050000000008},5.7,149,48690,{"$f":"IF(H19>$U$4,IF(I19*0.02>960,960,I19*0.02),IF(H19>0,IF(I19*0.015>720,720,I19*0.015),0))","v":960},{"$f":"J19*Eingabe!$C$52","v":288},"https://konfigurator.volkswagen.at/cc-at/de_AT_VW22/"]
[]
[]
[]
[]
[]
[]
[]
[]
[]
[]
[]
[]
[]
[]
[]
[]
[]
[]
[]
[]
[]
[]
[]
[]
[]
[]
[]
[]
[]
[]
[]
[]
[]
[]
[]
[]
[]
[]
[]
[]
[]
[]
[]
[]
[]
[]
[]
[]
[]
[]
[]
[]
[]
[]
[]
[]
[]
[]
[]
[]
[]
[]
[]
[]
[]
[null,null,null,null,null,null,null,null,null,null,null,null,"Citroen"]
[null,null,null,null,null,null,null,null,null,null,null,null,"C1 "]
[]
[null,null,null,null,null,null,null,null,null,null,null,null,"VTI 68 "]
[]
[null,null,null,null,null,null,null,null,null,null,null,null,null,"Toyota"]
[null,null,null,null,null,null,null,null,null,null,null,null,8990,"Aygo"]
[null,null,null,null,null,null,null,null,null,null,null,null,null,null,"Skoda","Renault"]
[null,null,null,null,null,null,null,null,null,null,null,null,null,"1.0 VVT-i","Citigo","Twingo"]
[null,null,null,null,null,null,null,null,null,null,null,null,4.0999999999999996,null,null,null,"smart","Audi","Fiat","Opel","Lancia","Suzuki","Ford","Nissan","Citroen","Peugeot","Kia","Mini","Hyundai ","Honda","Skoda","Mini","Ineffizientes Gerät"]
[null,null,null,null,null,null,null,null,null,null,null,null,null,null,"1.0l MPI","SCe 70","forfour","A1","Panda City Car","Adam JAM","Ypsilon","Swift 5-Türer","Fiesta Trend","Micra Acenta ","C3","208 3-Türer","Picanto 3-Türer","3-Türer","i10","Jazz MY16","Fabia","5-Türer","Marke und"]
[null,null,null,null,null,null,null,null,null,null,null,null,95,9990,null,"Stop&Start",null,null,null,null,null,null,null,null,null,null,null,null,null,null,null,null,"Modell anonymisiert"]
[null,null,null,null,null,null,null,null,null,null,null,null,null,null,null,null,"52 kW mit","1.0 TFSI ultra","0.9 TwinAir","1.0 Turbo EcoFelx","0.9 8V TwinIR ","1.2 Dualjet","1.0 Auto","1.2 l DIG-S","PureTech 68","1.2 PureTech 82","1.0 MPI ISG","Cooper","blue 1.0","1.3 TREND","1.0 l MPI ","Cooper","k.A."]
[null,null,null,null,null,null,null,null,null,null,null,null,6,null,9920,11590,"Start-Stop","15'-16'","Start&Stop","Direct injection",null,null,"Start/Stop-System",null,null,"ASG5"]
[null,null,null,null,null,null,null,null,null,null,null,null,5,4.0999999999999996,null,null,"Automatik",null,null,"66 kW",null,null,"48 kW"]
[null,null,null,null,null,null,null,null,null,null,null,null,51,null,null,null,11710,17960,14290,16400,16750,14990,15137,15700,11990,16100,10890,20800,10390,17420,11760,20800,"k.A."]
[null,null,null,null,null,null,null,null,null,null,null,null,null,95,4.2,4.2]
[null,null,null,null,null,null,null,null,null,null,null,null,69]
[null,null,null,null,null,null,null,null,null,null,null,null,null,6,95,95,4.2,4.2,4.2,4.2,4.2,4.3,4.3,4.3,4.4000000000000004,4.4000000000000004,4.4000000000000004,4.5,4.5999999999999996,4.5999999999999996,4.7,4.7,6]
[null,null,null,null,null,null,null,null,null,null,null,null,"M5",4]
[null,null,null,null,null,null,null,null,null,null,null,null,3466,51,6,6,97,97,99,99,99,99,99,99,102,102,102,105,106,106,106,109,139]
[null,null,null,null,null,null,null,null,null,null,null,null,1884,null,4,4]
[null,null,null,null,null,null,null,null,null,null,null,null,1460,69,44,52,6,6,6,6,6,6,6,6,6,6,6,6,6,6,6,6,6]
[null,null,null,null,null,null,null,null,null,null,null,null,null,null,null,null,4,5,4,4,5,5,5,5,5,5,5,4,5,5,5,5,5]
[null,null,null,null,null,null,null,null,null,null,null,null,null,"M5",60,71,52,60,63,66,63,66,48,72,60,50,48,100,49,75,44,100,141]
[null,null,null,null,null,null,null,null,null,null,null,null,null,3455]
[null,null,null,null,null,null,null,null,null,null,null,null,null,1968,"M5","M5",71,82,86,90,86,90,65,98,82,68,65,136,67,102,60,136,192]
[null,null,null,null,null,null,null,null,null,null,null,null,null,1460,3563,3595]
[null,null,null,null,null,null,null,null,null,null,null,null,null,null,1910,"k.A.","M5","M5","A5","M6","M5","M5","M5","M5","M5","AMT5","M5","M6","M5","CVT","M5","M6","M6"]
[null,null,null,null,null,null,null,null,null,null,null,null,"Feel, Shine, Start ",null,1463,1554,3495,3973,3653,3698,3842,3850,3969,3825,3941,3962,3595,3821,3665,3995,3992,3982,"k.A."]
[null,null,null,null,null,null,null,null,null,"Opel","VW",null,null,null,"1.0l (4.2, 98, 55, 75)",null,1752,1906,1882,1966,"x",1950,1978,1937,1994,2004,1875,1932,1905,1980,1958,1932,"k.A."]
[null,null,"Suzuki","Peugeot ","Fiat","MItsubishi","smart","Suzuki","VW","Karl","up!",null,"auch als 5 -Türer ",null,null,null,1554,1416,1551,1484,1518,1535,1495,1520,1524,1460,1480,1414,1500,1525,1452,1425,"k.A."]
["nach diesem Kriterium sortieren","Modell","Celerio 5-Türer","108 3-Türer","500 Lounge","Space Star Inform","fortwo","Baleno","Polo",null,null,null,null,null,null,null,null,"1.0 TFSI ultra",null,"1.0 Turbo EcoFelx",null,null,"1.0 Eco Boost Auto",null,"PureTech 68","1.0 PureTech 82","1.2 MPI","One",null,null,"1.0 MPI","One"]
[null,null,null,null,null,null,null,null,null,"1.0 EcoTEC","1.0 BlueMotion",null,null,null,null,null,null,"15'-16'",null,"Direct injection",null,null,"Start/Stop-System",null,"(4.3, 99, 50, 68)","(4.5, 104, 60, 82)","(4.6, 106, 62, 85)","(4.6, 108, 75, 102)",null,null,"(4.8, 108, 55, 75)","(4.8,112,75,102)"]
["nach diesem Kriterium sortieren","Motor","1.0 Dualjet","e-Vit 68","0.9 8V TA","1,0 MIVEC AS&G","52 kW mit","1.2 Dualjet SHVS","1.0 TSI BlueMotion","Start Stop","Technology",null,null,null,null,null,null,"(4.2, 97,70, 95)",null,"85 kW",null,null,"(4.3, 99, 92, 125)",null,"PureTech 110 S&S","Pure Tech 110 S&S",null,null,null,null,"1.2 TSI"]
[null,null,null,null,"Start&Stop ",null,"Start-Stop-Automatik",null,null,null,null,null,null,null,null,null,null,null,null,"(5.0,112,85,115)",null,null,null,null,"(4.5, 104, 81, 110)","(4.5, 103, 81, 110)",null,null,null,null,"(4.7, 107, 66, 90)"]
[null,null,null,null,null,null,null,null,null,10580,114540,null,"nach diesem Kriterium sortieren","Als 3-Türer oder","Active,","Zen, Intens",null,null,null,null,null,null,null,null,null,null,null,null,null,null,"1.2 TSI"]
["nach diesem Kriterium sortieren","Kaufpreis bei",12190,11490,16650,11490,11010,18490,18090,null,null,null,"CO2-Emissionen","5-Türer erhältlich","Style, ",null,null,null,null,null,null,null,null,null,null,null,null,null,null,null,"(4.8, 110, 81, 110)"]
[null,"Grundausstattung",null,null,null,null,null,null,null,null,null,null,84,null,null,null,null,"Sportback, sport,","Pop, Easy","Glam, Slam",null,"flash,",null,"N-TEC","Seductio, Attraction","Active, Allure","Silber","One, Cooper","Life, Comfort","Trend, Comfort","Joy,","One, Cooper"]
[null,"[ab EUR] inkl MWSt.",null,null,null,null,null,null,null,4.0999999999999996,4.0999999999999996,null,88,null,null,null,null,"design","Lounge",null,null,"shine",null,"Supermouse, Acenta","Exclusive",null,null,null,null,"Elegance","Monte Carlo "]
["nach diesem Kriterium sortieren","Kraftstoffver-",3.6,3.8,3.8,4,4.0999999999999996,4,4.0999999999999996,null,null,null,90,null,null,null,null,null,null,null,"auch als Automatik","Als 3-Türer oder","Als 3-Türer oder",null,"Auch als DS3","Als 3-Türer oder","Als 3-Türer oder",null,null,null,"Auch als Combi"]
[null,"brauch [l/100km]",null,null,null,null,null,null,null,94,95,null,92,null,null,null,null,null,null,null,"sehr gute Werte","5-Türer erhältlich","5-Türer erhältlich",null,"erhältlich","5-Türer erhältlich","5-Türer erhältlich",null,null,null,"erhältlich "]
["nach diesem Kriterium sortieren","CO2-Emissionen",84,88,90,92,93,94,94,null,null,null,93,"[g/km]"]
[null,"[g/km]",null,null,null,null,null,null,null,6,6,null,94,null,"nach diesem Kriterium sortieren","nach diesem Kriterium sortieren"]
["nach diesem Kriterium sortieren","EU-Abgasnorm",6,6,6,6,6,6,6,5,4,null,101,null,"EU-Abgasnorm","Sitzplätze"]
["nach diesem Kriterium sortieren","Sitzplätze",5,4,4,5,2,5,5,55,44,null,94,null,6,5,"nach diesem Kriterium sortieren",null,"nach diesem Kriterium sortieren",null,"nach diesem Kriterium sortieren","nach diesem Kriterium sortieren","nach diesem Kriterium sortieren","nach diesem Kriterium sortieren","nach diesem Kriterium sortieren",null,null,null,null,null,"nach diesem Kriterium sortieren",null,"Anmerkung"]
["nach diesem Kriterium sortieren","Leistung",50,51,63,52,52,66,70,null,null,null,95,null,6,4,"Leistung","[kW]","Leistung","[PS]","Getriebe","Länge [mm]","Breite mit Außenspiegel [mm]","Höhe ohne Dachreeling [mm]","andere Motoren","(Verbrauch, CO2-Emission,","Leistung [kW], Leistung [PS])",null,null,null,"Modellvarianten"]
[null,"[kW]",null,null,null,null,null,null,null,75,60,null,95,null,6,4,50,null,68,null,"M5",3600,1950,1530,null,null,null,null,null,null,"pure, clear","shine"]
["nach diesem Kriterium sortieren","Leistung",68,69,85.68,71,71,90,95,null,null,null,95,null,6,5,51,null,69,null,"M5",3470,2004,1450,null,null,null,null,null,null,"Active, Allure",null,"Als 3-Türer oder","5-Türer erhältlich"]
[null,"[PS]",null,null,null,null,null,null,null,"M5","M5",null,95,null,6,2,63,null,85.68,null,"M5",3546,1882,1488,"1.2 8V","S&S Dualogic","(4.5, 105, 51, 69)",null,null,null,"500C"]
["nach diesem Kriterium sortieren","Getriebe","M5","M5","M5","M5","M5","M5","M6",3675,3540,null,95,null,6,5,52,null,71,null,"M5",3710,"k.A.",1505,"1.2 MIVEC AS&G","(4.3, 100, 59, 80)",null,null,null,null,"Comfort Line,","Intense"]
["nach diesem Kriterium sortieren","Länge [mm]",3600,3470,3546,3710,2695,3995,3972,1876,1910,null,97,null,6,5,52,null,71,null,"M5",2695,1752,1555,null,null,null,null,null,null,null,null,"Höhe entspricht","Microvan-Kriterien"]
["nach diesem Kriterium sortieren","Breite mit Außenspiegel [mm]",1950,2004,1882,"k.A.",1752,"k.A.",1901,1476,1489,null,97,null,6,5,66,null,90,null,"M5",3995,"k.A.",1470]
["nach diesem Kriterium sortieren","Höhe ohne Dachreeling [mm]",1530,1450,1488,1505,1555,1470,1453,null,"1.0 BlueMotion",null,99,null,6,4,70,null,95,null,"M6",3972,1901,1453,"1.0 TSI","(4.3, 99, 81, 110),","1.2 TSI","(4.7, 107, 66, 90)",null,null,"BlueMotion, Austria","Comfortline, Highline"]
["nach diesem Kriterium sortieren","andere Motoren",null,null,"1.2 8V","1.2 MIVEC AS&G",null,null,"1.0 TSI",null,"(4.2, 98, 55, 75)",null,99,null,6,5,55,null,75,null,"M5",3675,1876,1476,null,null,null,null,null,null,"Edition,","Österreich Edition","Als 3-Türer oder","5-Türer erhältlich","4/5 Sitzer"]
[null,"(Verbrauch, CO2-Emission,",null,null,"S&S Dualogic","(4.3, 100, 59, 80)",null,null,"(4.3, 99, 81, 110),",null,null,null,99,null,6,4,44,null,60,null,"M5",3540,1910,1489,"1.0 BlueMotion","(4.2, 98, 55, 75)",null,null,null,null,"move up!, club up!,","high up!"]
[null,"Leistung [kW], Leistung [PS])",null,null,"(4.5, 105, 51, 69)",null,null,null,"1.2 TSI",null,null,null,99,null,6,4,51,null,69,null,"M5",3466,1884,1460,null,null,null,null,null,null,"Feel, Shine, Start ",null,"auch als 5 -Türer "]
[null,null,null,null,null,null,null,null,"(4.7, 107, 66, 90)",null,null,null,99,null,6,4,51,null,69,null,"M5",3455,1968,1460,null,null,null,null,null,null,null,null,"Als 3-Türer oder","5-Türer erhältlich"]
[null,null,null,null,null,null,null,null,null,null,null,null,99,null,6,4,44,null,60,null,"M5",3563,1910,1463,"1.0l (4.2, 98, 55, 75)",null,null,null,null,null,"Active,","Style, "]
[null,null,null,null,null,null,null,null,null,"Edition,","move up!, club up!,",null,102,null,6,5,52,null,71,null,"M5",3595,"k.A.",1554,null,null,null,null,null,null,"Zen, Intens"]
["nach diesem Kriterium sortieren","Modellvarianten","pure, clear","Active, Allure","500C","Comfort Line,",null,null,"BlueMotion, Austria","Österreich Edition","high up!",null,102,null,6,4,52,null,71,null,"M5",3495,1752,1554]
[null,null,"shine",null,null,"Intense",null,null,"Comfortline, Highline","Als 3-Türer oder",null,null,102,null,6,4,60,null,82,null,"M5",3973,1906,1416,"1.0 TFSI ultra","15'-16'","(4.2, 97,70, 95)",null,null,null,"Sportback, sport,","design"]
["Anmerkung",null,null,"Als 3-Türer oder",null,null,"Höhe entspricht",null,null,"5-Türer erhältlich",null,null,105,null,6,5,63,null,86,null,"A5",3653,1882,1551,null,null,null,null,null,null,"Pop, Easy","Lounge"]
[null,null,null,"5-Türer erhältlich",null,null,"Microvan-Kriterien",null,null,"4/5 Sitzer",null,null,106,null,6,5,66,null,90,null,"M6",3698,1966,1484,"1.0 Turbo EcoFelx","Direct injection","85 kW","(5.0,112,85,115)",null,null,"Glam, Slam"]
[null,null,null,null,null,null,null,null,null,null,null,null,106,null,6,5,63,null,86,null,"M5",3842,"x",1518,null,null,null,null,null,null,null,null,"auch als Automatik","sehr gute Werte"]
[null,null,null,null,null,null,null,null,null,null,null,null,106,null,6,5,66,null,90,null,"M5",3850,1950,1535,null,null,null,null,null,null,"flash,","shine","Als 3-Türer oder","5-Türer erhältlich"]
[null,null,null,null,null,null,null,null,null,"nach diesem Kriterium sortieren",null,null,109,null,6,5,48,null,65,null,"M5",3969,1978,1495,"1.0 Eco Boost Auto","Start/Stop-System","(4.3, 99, 92, 125)",null,null,null,null,null,"Als 3-Türer oder","5-Türer erhältlich"]
[null,"nach diesem Kriterium sortieren",null,"nach diesem Kriterium sortieren",null,null,"nach diesem Kriterium sortieren",null,null,"Kraftstoffver-","brauch [l/100km]",null,139,null,6,5,72,null,98,null,"M5",3825,1937,1520,null,null,null,null,null,null,"N-TEC","Supermouse, Acenta"]
[null,"Modell",null,"Motor",null,null,"Kaufpreis bei","Grundausstattung","[ab EUR] inkl MWSt.",3.6,null,null,null,null,6,5,60,null,82,null,"M5",3941,1994,1524,"PureTech 68","(4.3, 99, 50, 68)","PureTech 110 S&S","(4.5, 104, 81, 110)",null,null,"Seductio, Attraction","Exclusive","Auch als DS3","erhältlich"]
["Suzuki","Celerio 5-Türer",null,"1.0 Dualjet",null,null,12190,null,null,3.8,null,null,null,null,6,4,50,null,68,null,"AMT5",3962,2004,1460,"1.0 PureTech 82","(4.5, 104, 60, 82)","Pure Tech 110 S&S","(4.5, 103, 81, 110)",null,null,"Active, Allure",null,"Als 3-Türer oder","5-Türer erhältlich"]
["Peugeot ","108 3-Türer",null,"e-Vit 68",null,null,11490,null,null,3.8,null,null,null,null,6,5,48,null,65,null,"M5",3595,1875,1480,"1.2 MPI","(4.6, 106, 62, 85)",null,null,null,null,"Silber",null,"Als 3-Türer oder","5-Türer erhältlich"]
["Fiat","500 Lounge",null,"0.9 8V TA","Start&Stop ",null,16650,null,null,4,null,null,null,null,6,5,100,null,136,null,"M6",3821,1932,1414,"One","(4.6, 108, 75, 102)",null,null,null,null,"One, Cooper"]
["MItsubishi","Space Star Inform",null,"1,0 MIVEC AS&G",null,null,11490,null,null,4.0999999999999996,null,null,null,null,6,5,49,null,67,null,"M5",3665,1905,1500,null,null,null,null,null,null,"Life, Comfort"]
["smart","fortwo",null,"52 kW mit","Start-Stop-Automatik",null,11010,null,null,4,null,null,null,null,6,5,75,null,102,null,"CVT",3995,1980,1525,null,null,null,null,null,null,"Trend, Comfort","Elegance"]
["Suzuki","Baleno",null,"1.2 Dualjet SHVS",null,null,18490,null,null,4.4000000000000004,null,null,null,null,6,5,44,null,60,null,"M5",3992,1958,1452,"1.0 MPI","(4.8, 108, 55, 75)","1.2 TSI","(4.7, 107, 66, 90)","1.2 TSI","(4.8, 110, 81, 110)","Joy,","Monte Carlo ","Auch als Combi","erhältlich "]
["VW","Polo",null,"1.0 TSI BlueMotion",null,null,18090,null,null,4.0999999999999996,null,null,null,null,null,null,100,null,136,null,"M6",3982,1932,1425,"One","(4.8,112,75,102)",null,null,null,null,"One, Cooper"]
["Opel","Karl",null,"1.0 EcoTEC","Start Stop",null,10580,null,null,4.0999999999999996,null,null,null,null,null,null,141,null,192,null,"M6","k.A.","k.A.","k.A."]
["VW","up!",null,"1.0 BlueMotion","Technology",null,11450,null,null,4.0999999999999996]
["Citroen","C1 ",null,"VTI 68 ",null,null,8990,null,null,4.0999999999999996]
["Toyota","Aygo",null,"1.0 VVT-i",null,null,9990,null,null,4.2]
["Skoda","Citigo",null,"1.0l MPI",null,null,9920,null,null,4.2]
["Renault","Twingo",null,"SCe 70","Stop&Start",null,11590,null,null,4.2]
["smart","forfour",null,"52 kW mit","Start-Stop","Automatik",11710,null,null,4.2]
["Audi","A1",null,"1.0 TFSI ultra","15'-16'",null,17870,null,null,4.2,null,null,"VW","Ford"]
["Fiat","Panda City Car",null,"0.9 TwinAir","Start&Stop",null,14290,null,null,4.2,null,null,"T-Roc","Tourneo Courier"]
["Opel","Adam JAM",null,"1.0 Turbo EcoFelx","Direct injection","66 kW",16400,null,null,4.2,null,null,"1,6 TDI","1.5 TDCi S&S"]
["Lancia","Ypsilon",null,"0.9 8V TwinIR ",null,null,16750,null,null,4.3]
["Suzuki","Swift 5-Türer",null,"1.2 Dualjet",null,null,14990,null,null,4.3,null,null,"25 770","18 142"]
["Ford","Fiesta Trend",null,"1.0 Auto","Start/Stop-System","48 kW",15700,null,null,4.3]
["Nissan","Micra Acenta ",null,"1.2 l DIG-S",null,null,15137,null,null,4.4000000000000004]
["Citroen","C3",null,"PureTech 68",null,null,11990,null,null,4.4000000000000004,null,null,5.2,5.4]
["Peugeot","208 3-Türer",null,"1.2 PureTech 82","ASG5",null,16100,null,null,4.4000000000000004]
["Kia","Picanto 3-Türer",null,"1.0 MPI ISG",null,null,10890,null,null,4.5,null,null,136,141]
["Mini","3-Türer",null,"Cooper",null,null,20800,null,null,4.5999999999999996]
["Hyundai ","i10",null,"blue 1.0",null,null,10390,null,null,4.5999999999999996,null,null,"6d-TEMP-EVAP-ISC","6d-TEMP-EVAP-ISC"]
["Honda","Jazz MY16",null,"1.3 TREND",null,null,17420,null,null,4.7,null,null,5,5]
["Skoda","Fabia",null,"1.0 l MPI ",null,null,11760,null,null,4.7,null,null,85,55]
["Mini","5-Türer",null,"Cooper",null,null,20800,null,null,6]
["Ineffizientes Gerät","Marke und","Modell anonymisiert","k.A.",null,null,"k.A.",null,null,null,null,null,115,75]
[]
[null,null,null,null,null,null,null,null,null,null,null,null,"M6","M6"]
[null,null,null,null,null,null,null,null,null,null,null,null,"4 234","4 157"]
[null,null,null,null,null,null,null,null,null,null,null,null,"1 992","2 112"]
[null,null,null,null,null,null,null,null,null,null,null,null,"1 573","1 741"]
[null,null,null,null,null,null,null,null,null,null,null,null,"1 395","1 420"]
[null,null,null,null,null,null,null,null,null,null,null,null,"2,0 TDI","1.5 TDCi SS"]
[null,null,null,null,null,null,null,null,null,null,null,null,"(5.4,141,110,150)","(5.5,144,74,101)"]
[]
[]
[null,null,null,null,null,null,null,null,null,null,null,null,"T-Roc, Design, Sport","Trend, Titanium, Sport"]
[]
[null,null,null,null,null,null,null,null,null,null,null,null,null,"Höhe entspricht"]
[null,null,null,null,null,null,null,null,null,null,null,null,null,"Kompakt-Van"]
[]
[]
[]
[]
[]
[]
[]
[null,null,"Peugeot","BMW","Citroen","Renault","Seat","Fiat","Ford","Hyundai","Mini","Skoda"]
["nach diesem Kriterium sortieren","Modell",2008,"2er Active Tourer","C3 Aircross","Captur","Arona","500X Urban","EcoSport","Kona","Countryman","Kamiq"]
["nach diesem Kriterium sortieren","Motor","BlueHDi 100","216d","Blue HDi 100","Blue dCi 115","1.6 TDI","1.6 MultiJet","1.5 l EcoBlue","1.6 CRDi","One","1.6l TDI"]
[null,null,null,null,"S&S",null,null,"95 SCR"]
["nach diesem Kriterium sortieren","Kaufpreis bei","25 510","32 050","20 790","24 890","19 990","22 100","23 700","22 690","28 500","24 050"]
[null,"Grundausstattung"]
[null,"[ab EUR] inkl MWSt."]
["nach diesem Kriterium sortieren","Kraftstoffver-",4.5,4.7,4.7,4.7,4.8,4.8,4.9000000000000004,5,4.9000000000000004,5]
[null,"brauch [l/100km]"]
["nach diesem Kriterium sortieren","CO2-Emissionen",118,123,123,123,125,126,129,129,129,131]
[null,"[g/km]"]
["nach diesem Kriterium sortieren","EU-Abgasnorm","6d-TEMP","6d","6d-TEMP","6d-TEMP","6d-TEMP","6d-TEMP-EVAP-ISC","6d-TEMP-EVAP-ISC","6d-TEMP-EVAP","6d-TEMP","6d-TEMP-EVAP-ISC"]
["nach diesem Kriterium sortieren","Sitzplätze",5,5,5,5,5,5,5,5,5,5]
["nach diesem Kriterium sortieren","Leistung",75,85,75,85,70,70,74,85,85,85]
[null,"[kW]"]
["nach diesem Kriterium sortieren","Leistung",100,116,102,115,95,95,100,116,116,115]
[null,"[PS]"]
["nach diesem Kriterium sortieren","Getriebe","M6","M6","M6","M6","M5","M5","M6","M6","M6","M6"]
["nach diesem Kriterium sortieren","Länge [mm]","4 300","4 354","4 154","4 227","4 138","4 264","4 096","4 165","4 299","4 241"]
["nach diesem Kriterium sortieren","Breite [mm]","1 987","2 039","1 976","2 003","1 942","2 025","2 057","2 070","1 822","1 988"]
["nach diesem Kriterium sortieren","Höhe [mm]","1 530","1 555","1 597","1 576","1 543","1 595","1 653","1 550","1 557","1 553"]
["nach diesem Kriterium sortieren","Leergewicht [kg]","1 205","1 495","1 292","1 490","1 297","1 320","1 395","1 318","1 505","1 336"]
["nach diesem Kriterium sortieren","andere Motoren","BlueHDi 130","218d","Blue HDi 120",null,null,"1.6 MultiJet","1.5 EcoBlue","1.6 CRDi","Cooper D"]
[null,"(Verbrauch, CO2-Emissionen,","(4.9,129,96,130)","(4.9,129,110,150)","(5.2,137,88,120)",null,null,"(5.2,137,88,120)","(5.3,138,88,120)","(5.1,134,100,136)","(5.0,130,110,150)"]
[null,"Leistung [kW], Leistung [PS])",null,"220d",null,null,null,null,null,null,"Cooper SD"]
[null,null,null,"(5.1,134,140,190)",null,null,null,null,null,null,"(5.3,139,140,190)"]
["nach diesem Kriterium sortieren","Modellvarianten","Allure, Active,",null,"Feel, Shine","Life, Zen,","Reference, Style,","Lounge, Cross, Sport","ST-Line, Titanium","Level 2,3,4,6","One, Cooper","Active, Ambition"]
[null,null,"GT-Line",null,null,"Intens, Edition One","Xcellence",null,"Cool&Connect",null,null,"Style, Monte Carlo"]
["Anmerkung",null,"Länge entspricht","Länge entspricht",null,"Länge entspricht",null,"Länge entspricht","Höhe entspricht",null,"Länge entspricht"]
[null,null,"Kompakt-Van","Kompakt-Van",null,"Kompakt-Van",null,"Kompakt-Van","Kompakt-Van",null,"Kompakt-Van"]
[]
[]
[]
[]
[]
[]
[]
[]
[]
[]
[null,null,null,null,null,null,null,null,null,null,null,null,"6d-TEMP",4,53,null,72,null,"M5",3475,1884,1460,915,null,null,null,"Active,","Allure, Collection",null,"Als 3-Türer oder","5-Türer erhältlich"]
[null,null,null,null,null,null,null,null,null,null,null,null,"6d-TEMP",4,53,null,72,null,"M5",3466,1884,1460,867,null,null,null,"Feel, Shine, Origins"]
[null,null,null,null,null,null,null,null,null,null,null,null,"6d-TEMP-EVAP",4,49,null,67,null,"M5",3670,1680,1480,924,"1.2l (5.2,117,62,84)",null,null,"Level 1,2,3,4",null,null,"Auch als 5-Sitzer","erhältlich"]
[null,null,null,null,null,null,null,null,null,null,null,null,"6d-TEMP-EVAP-ISC",4,53,null,72,null,"M5",3465,1615,1460,840,null,null,null,"x, x-play,","x-cite, x-clusiv,","x-style"]
[null,null,null,null,null,null,null,null,null,null,null,null,"6d-TEMP",5,52,null,71,null,"M5",3795,1665,1505,870,"1.2 MIVEC AS&G","(5.3, 121, 59, 80)",null,"Inform,","Invite Connect"]
[null,null,null,null,null,null,null,null,null,null,null,null,"6d-TEMP-EVAP",5,66,null,90,null,"M5",3840,1735,1480,857,null,null,null,"Clear, Shine"]
[null,null,null,null,null,null,null,null,null,null,null,null,"6d-TEMP-EVAP",4,49,null,67,null,"M5",3595,1595,1485,588,"1.2 MPI ISG","(5.6,126,62,84)",null,"Neon, Titan, Silber,","Gold, GT-Line, X-Line",null,"Auch als 5-Sitzer","erhältlich"]
[null,null,null,null,null,null,null,null,null,null,null,null,"6d-TEMP-EVAP",4,54,null,74,null,"M5",3615,1646,1541,981,"TCe 95","(5.3,119,68,93)",null,"Life, Intens, Zen"]
[null,null,null,null,null,null,null,null,null,null,null,null,"6d-TEMP-EVAP-ISC",5,70,null,95,null,"M5",3997,1958,1467,1116,"1.0 MPI","(5.8,132,44,60)",null,"Active, Ambition,","Style, Monte Carlo",null,"Auch als Combi","erhältlich "]
[null,null,null,null,null,null,null,null,null,null,null,null,"6d-TEMP-EVAP-ISC",5,44,null,60,null,"M5",3600,1910,1504,980,"1.0l","(5.3,120,85,115)",null,"black style,","white style,","R-Line, GTI"]
[null,null,null,null,null,null,null,null,null,null,null,null,"6d-TEMP",4,70,null,95,null,"M5",3954,1906,1416,1110,"30 TSFI","(4.8,122,85,116)",null,"advanced,","S-line"]
[null,null,null,null,null,null,null,null,null,null,null,null,"6d-TEMP",5,74,null,100,null,"M5",3999,1935,1455,1135,"DIG-T 117","(5.9,133,86,117)",null,"Visia, Acenta, Tekna,","N-Connecta,","Visia Plus"]
[null,null,null,null,null,null,null,null,null,null,null,null,"6d-TEMP-EVAP",5,61,null,83,null,"M5",3996,2009,1490,1037,"PureTech 110","(5.8,131,81,110)",null,"Feel, Shine"]
[null,null,null,null,null,null,null,null,null,null,null,null,"6d-TEMP-EVAP-ISC",5,53,null,72,null,"M5",3945,1695,1510,980,"1.5 VVT-i","(6.0,135,82,111)",null,"Young, Active,","Lounge"]
[null,null,null,null,null,null,null,null,null,null,null,null,"6d-TEMP",4,55,null,75,null,"M6",3821,1727,1414,1215,"One (5.0,114,75,102),","Cooper","(5.0,115,100,136)","Salt, Pepper, Chili",null,null,"Auch als 5-Türer","erhältlich"]
[null,null,null,null,null,null,null,null,null,null,null,null,"6d-TEMP-EVAP",4,51,null,69,null,"A5",3571,1627,1488,900,null,null,null,"500C, 500S","Lounge, Sport","Star, Rockstar","Hybrid-Variante"]
[null,null,null,null,null,null,null,null,null,null,null,null,"6d-TEMP-EVAP-ISC",5,70,null,95,null,"M6",4065,1941,1466,1163,"1.1l","(5.3,120,55,75)","1.0 Ecoboost","(5.1,115,70,95)","1.0 Ecoboost","(5.6,127,92,125)","Trend, Cool-Connect,","Titanium, ST-Line",null,"Auch als 5-Türer","erhältlich"]
[null,null,null,null,null,null,null,null,null,null,null,null,"6d-TEMP-EVAP-ISC",5,74,null,100,null,"M6",4378,1979,1471,1322,"1.0 EcoBoost","(5.5, 124, 92, 125)","1.0 EcoBoost","(5.9,133,92,125)","1.5 EcoBoost","(6.3,142,110,150)","Trend, Titanium,","Active, ST-Line,","Vignale, Cool-Connect","Auch als Kombi","erhältlich "]
[null,null,null,null,null,null,null,null,null,null,null,null,"6d",5,81,null,110,null,"M6",4370,2042,1485,1280,"1.2 TDI","(5.3,120,96,130)","1.2 TDI","(5.3,120,107,145)",null,null,"Edition, GS-Line,","Elegance, Ultimate",null,"Auch als Kombi","erhältlich "]
[null,null,null,null,null,null,null,null,null,null,null,null,"6d-TEMP-EVAP-ISC",5,70,null,95,null,"M5",4262,1958,1488,1136,null,null,null,null,null,null,"Active, Amibition,","Style, Monte Carlo"]
[null,null,null,null,null,null,null,null,null,null,null,null,"6d",5,55,null,75,null,"M6",4070,1695,1495,1100,"G90","(5.3,120,66,90)",null,null,null,null,"Life, Takumi,","Takumi Plus"]
[null,null,null,null,null,null,null,null,null,null,null,null,"6d-TEMP-EVAP",5,53,null,72,null,"M5",4050,1988,1440,1148,"TCe 100","(5.1,116,74,100)","TCe 130","(5.7,130,96,130)",null,null,"Life, Zen, Intens,","R.S. Line, Initiale",null,"Auch als Kombi","erhältlich "]
[null,null,null,null,null,null,null,null,null,null,null,null,"6d-TEMP-EVAP-ISC",5,85,null,115,null,"M6",4053,1964,1461,1120,"1.0 (5.4,123,44,60)",null,null,null,null,null,"Comfortline,","Highline, GTI"]
[null,null,null,null,null,null,null,null,null,null,null,null,"6d-TEMP",5,59,null,80,null,"M5",4059,1942,1444,1099,"1.0 ECO TSI","(5.5,123,70,95)","1.0 ECO TSI","(5.4,122,85,115)","1.0 (4.9,112,59,80)",null,"Fast Lane, Style,","Xcellence,FR","Reference"]
[null,null,null,null,null,null,null,null,null,null,null,null,"6d-TEMP",5,81,null,110,null,"M6",4282,1816,1459,1202,null,null,null,null,null,null,"Style, FR",null,null,"Auch als Kombi","erhältlich "]
[null,null,null,null,null,null,null,null,null,null,null,null,"6d-TEMP-EVAP-ISC",5,96,null,130,null,"M6",4284,1789,1491,1315,null,null,null,null,null,null,"Life"]
[null,null,null,null,null,null,null,null,null,null,null,null,"6d",5,55,null,75,null,"M5",4060,1960,1433,1055,"1.2 (5.5,124,74,100)","1.2 (5.6,128,96,130)",null,null,null,null,"Edition, Elegance,","GS-Line"]
[null,null,null,null,null,null,null,null,null,null,null,null,"6d",5,55,null,75,null,"M5",4055,1960,1430,1055,"PureTech 100","(5.4,123,74,101)","PureTech 130","(5.6,127,96,131)",null,null,"Like, Active, Allure","GT-Line, GT"]
[null,null,null,null,null,null,null,null,null,null,null,null,"6d-TEMP-EVAP",5,74,null,100,null,"M5",4035,1734,1474,1065,"1.25l","(5.9,133,55,75)","1.25l","(5.8,132,62,84)","1.0 TGDI","(5.6,137,88,120)","Level 1,2,3,4,5"]
[null,null,null,null,null,null,null,null,null,null,null,null,"6d-TEMP-EVAP",5,74,null,100,null,"M5",4065,1725,1450,1080,"1.25 MPI ISG","(5.8,132,62,84)","1.0 TGDI GPF ISG","(5.8,133,88,120)",null,null,"Neon, Titan, Silber,","Gold, GT-Line"]
[null,null,null,null,null,null,null,null,null,null,null,null,"6d-TEMP-EVAP",5,74,null,100,null,"M6",4310,1800,1447,1222,"1.0 TGDI GPF ISG","(5.6,126,88,120)","1.4 TGDI GPF ISG","(5.9,135,103,140)",null,null,"Titan, Silber,Gold","Platin, GT-Line, GT",null,"Auch als Kombi","erhältlich "]
[null,null,null,null,null,null,null,null,null,null,null,null,"6d-TEMP-EVAP-ISC",5,70,null,95,null,"M5",4362,1988,1471,1192,"1.0 TSI","(5.5,124,85,115)","1.5 TSI","(5.7,130,110,150)",null,null,"Active, Amibition,","Style, Monte Carlo"]
[null,null,null,null,null,null,null,null,null,null,null,null,"6d-TEMP-EVAP-ISC",5,74,null,100,null,"M6",4668,1979,1494,1383,"1.0 EcoBoost","(5.6,126,92,125)","1.5 EcoBoost","(5.8,132,110,150)","1.5 EcoBoost","(6.0,137,134,182)","Trend, Titanium,","Active, ST-Line,","Vignale, Cool-Connect"]
[null,null,null,null,null,null,null,null,null,null,null,null,"6d-TEMP-EVAP-ISC",5,84,null,115,null,"M6",4689,1994,1468,1285,"1.5 TSI","(5.7, 129, 110, 150)",null,null,null,null,"Business, Premium"]
[null,null,null,null,null,null,null,null,null,null,null,null,"6d",5,81,null,110,null,"M6",4702,2040,1510,1355,"1.2 TDI","(5.4,122,96,130)","1.2 TDI","(5.4,122,107,145)",null,null,"Edition, GS Line,","Elegance, Ultimate"]
[2021,null,null,null,null,null,null,null,null,null,null,null,"6d-TEMP-EVAP",5,88,null,120,null,"M6",4585,2039,1465,1231,"1.5 DPI","(6.0,137,81,110)",null,null,null,null,"Level 2,3,4,5,6"]
[null,null,null,null,null,null,null,null,null,null,null,null,"6d-TEMP-EVAP-ISC",5,85,null,116,null,"M6",4567,2027,1515,1300,"1.5 TSI","(5.6,128, 96, 131)","1.5 TSI","(5.7, 130, 110, 150)",null,null,"Rabbit, Comfortline"]
["Peugeot ",108,"1.0 VTi 72",null,null,12740,null,null,4.8,"BENZIN",109,null,"6d-TEMP-EVAP",5,74,null,100,null,"M6",4600,1800,1465,1259,"1.4 TGDI ISG","(5.9,135,103,140)",null,null,null,null,"Titan, Silber, Gold,","Platin, GT-Line, GT"]
["Citroen","C1 ","VTi 72",null,null,11490,null,null,4.8,"BENZIN",110,null,"6d-TEMP",5,93,null,126,null,"M6",4518,2076,1434,1229,"1.5 VTEC Turbo","(6.1,139,134,182)",null,null,null,null,"Comfort, Elegance,","Executive, Sport, S"]
["Hyundai","i10","1.0l",null,null,10990,null,null,4.8,"BENZIN",110,null,"6d-TEMP",5,54,null,73,null,"M5",4501,1994,1521,1112,"TCe 90 S&S","(5.9,133,66,90)",null,null,null,null,"Access, Essential,","Comfort, Stepway,","Celebration"]
["Toyota","Aygo","1.0 VVT-i",null,null,11490,null,null,5,"BENZIN",112,null,"6d ISC-FCM",5,100,null,136,null,"M6",4549,1796,1446,1360,"A 200","(5.8,131,120,163)"]
["MItsubishi","Space Star","1.0 MIVEC AS&G",null,null,12990,null,null,5.0999999999999996,"BENZIN",115,null,"6d-TEMP-EVAP-ISC",5,110,null,150,null,"M6",4775,2083,1483,1425,"2.0 TSI","(7.6,171,140,190)",null,null,null,null,"Business, Elegance"]
["Suzuki","Swift","1.2 Dualjet",null,null,13490,null,null,5.0999999999999996,"BENZIN",115,null,"6d",5,81,null,110,null,"M6",4585,2043,1472,1205,"PureTech 130","(5.8, 130, 96, 131)",null,null,null,null,"Active, Style,","Access, Allure,","GT-Line, GT"]
["KIA","Picanto","1.0 MPI ISG",null,null,10190,null,null,5.0999999999999996,"BENZIN",116,null,"6d-TEMP-EVAP",5,84,null,115,null,"M6",4626,2058,1457,1231,"TCe 140","(6.0,136,103,140)","TCe 160","(6.2,140,117,159)",null,null,"Intens, Life, Bose","GT-Line, Limited"]
["Renault","Twingo","SCe 75",null,null,9990,null,null,5.3,"BENZIN",119,null,"6d-TEMP",5,103,null,140,null,"M6",4897,2093,1455,1441,"1.5 TDI","(6.1,138,121,165)",null,null,null,null,"Edition, Dynamic,","Innovation,","Ultimate","Auch als Combi"]
["Skoda","Fabia","1.0 TSI",null,null,13240,null,null,5.4,"BENZIN",123,null,"6d-TEMP",5,85,null,116,null,"M6",4650,1790,1435,1205,null,null,null,null,null,null,"Young, Active, Style"]
["VW","up!","1.0l",null,null,12680,null,null,5.4,"BENZIN",123,null,"6d-TEMP-EVAP-ISC",5,110,null,150,null,"M6",4861,1864,1458,1435,null,null,null,null,null,null,"Active, Ambition,","Style, Sportline",null,"Auch als Combi"]
["Audi","A1 SB","25 TSFI",null,null,21780,null,null,5.6,"BENZIN",126,null,"6d",5,133,null,181,null,"A8",4750,2079,1403,1420,null,null,null,null,null,null,"Allure, GT Line",null,null,"Auch als Combi"]
["Nissan","Micra","1.0 IGT 100",null,null,15090,null,null,5.6,"BENZIN",126,null,"6d-TEMP-EVAP",4,66,null,90,null,"A5",3700,1660,1595,860,null,null,null,null,"Clear, Shine"]
["Citroen","C3","PureTech 82",null,null,13390,null,null,5.7,"BENZIN",127,null,"6d-TEMP",5,70,null,95,null,"M5",4138,1780,1552,1180,"1.0 Eco TSI","(5.8,131,85,115)",null,null,"Style, Xcellence,","Reference, FR"]
["Toyota","Yaris","1.0 VVT-i",null,null,13190,null,null,5.8,"BENZIN",131,null,"6d-TEMP",5,54,null,73,null,"M5",4069,1994,1555,1052,"TCe 90","(5.9,133,66,90)",null,null,"Access, Essential,","Comfort, Stepway,","Celebration"]
["Mini","Mini 3-Türer","One First",null,null,19750,null,null,5.8,"BENZIN",133,null,"6d-TEMP-EVAP-ISC",4,51,null,69,null,"M5",3653,1882,1551,980,null,null,null,null,"Easy, Lounge",null,null,"Auch als 5-Sitzer","erhältlich"]
["Fiat",500,"1.2 Fire 70","Dualogic",null,18170,null,null,5.5,"BENZIN",135,null,"6d-TEMP-EVAP-ISC",5,70,null,95,null,"M5",4108,1977,1584,1245,"1.0 TSI","(6.0,137,85,115)",null,null,"Life, Style"]
["Ford","Fiesta Coupe","1.0 Ecoboost","Start&Stop",null,15300,null,null,5.0999999999999996,"BENZIN",115,null,"6d-TEMP-EVAP-ISC",5,74,null,100,null,"M6",4096,2057,1653,1349,"1.0 EcoBoost","(6.0,135,92,125)","1.0 EcoBoost","(6.0,136,103,140)","ST-Line, Trend","Titanium,","Cool & Connect","Höhe entspricht","Kompakt-Van"]
["Ford","Focus","1.0 EcoBoost",null,null,22100,null,null,5.3,"BENZIN",119,null,"6d-TEMP",5,74,null,100,null,"M5",4227,2003,1576,1248,"TCe 130","(6.3,141,96,130)",null,null,"Life, Zen, Intens,","Edition One, Initiale",null,"Länge entspricht","Kompakt-Van"]
["Opel","Astra","1.2 Turbo","Direct Injection",null,21739,null,null,5.2,"BENZIN",119,null,"6d-TEMP",5,86,null,117,null,"M6",4210,1983,1595,1182,null,null,null,null,"Visia, Acenta,","N-Connecta, Tekna,","N-Design","Länge entspricht","Kompakt-Van"]
["Skoda","Fabia Combi","1.0 TSI",null,null,13590,null,null,5.3,"BENZIN",119,null,"6d-TEMP-EVAP",5,81,null,110,null,"M6",4154,1976,1597,1247,"PureTech 130","(6.6,148,96,130)",null,null,"Feel, Shine, C-Series"]
["Mazda",2,"G75 Life",null,null,14690,null,null,5.3,"BENZIN",120,null,"6d-TEMP-EVAP",5,88,null,120,null,"M6",4165,2070,1550,1223,null,null,null,null,"Level 2,3,4,6"]
["Renault","Clio","SCe 75",null,null,12940,null,null,5.4,"BENZIN",120,null,"6d-TEMP",5,103,null,140,null,"M6",4170,1775,1595,1205,null,null,null,null,"clear, shine"]
["VW","Polo","1.0 TSI",null,null,15110,null,null,5.3,"BENZIN",120,null,"6d-TEMP-EVAP-ISC",5,85,null,116,null,"M6",4351,2050,1613,1330,"1.5 TSI","(5.7,1130,96,131)","1.5 TSI","(6.5,147,110,150)","Highline, Comfortline"]
["Seat","Ibiza","1.0l",null,null,12990,null,null,5.4,"BENZIN",122,null,"6d-TEMP",5,74,null,100,null,"M5",4341,2052,1693,1191,"TCe 130","(6.6,149,96,130)","TCe 150","(7.1,162,110,150)","Access, Comfort,","Essential, Prestige,","Celebration"]
["Seat","Leon","1.0 TSI",null,null,19990,null,null,5.4,"BENZIN",122,null,"6d",5,60,null,81,null,"M5",4212,1976,1605,1174,"1.2 Turbo","(6.1,138,81,110)","1.2 Turbo","(5.9,134,96,130)","Edition, Ultimate","Innovation"]
["VW","Golf","1.5 TSI ACT",null,null,26990,null,null,5.4,"BENZIN",122,null,"6d-TEMP-EVAP-ISC",5,85,null,116,null,"M6",4382,2025,1603,1344,"1.5 TSI","(6.3,144,110,150)",null,null,"City, Amibition,","Style"]
["Opel","Corsa","1.2l",null,null,14999,null,null,5.4,"BENZIN",123,null,"6d-TEMP-EVAP",7,96,null,131,null,"M6",4597,2117,1638,1423,null,null,null,null,"Feel, Shine"]
["Peugeot",208,"PureTech 75","S&S",null,15990,null,null,5.4,"BENZIN",123,null,"6d",5,96,null,131,null,"M6",4447,2098,1624,1320,null,null,null,null,"Allure, Active,","Access, GT Line"]
["Hyundai","i20","1.0 T-GDI",null,null,17190,null,null,5.5,"BENZIN",126,null,"6d",5,96,null,130,null,"M6",4477,2098,1609,1350,"1.6 Turbo","(7.2,163,133,181)",null,null,"Edition, Ultimate","Innovation"]
["KIA","Rio","1.0 TGDI GPF ISG",null,null,18090,null,null,5.5,"BENZIN",126,null,"6d-TEMP",5,80,null,109,null,"AMT6",4556,1800,1608,1515,"218i","(6.5,146,103,140)","220i","(6.8,154,141,192)"]
["KIA","Ceed","1.0 TGDI GPF ISG",null,null,17790,null,null,5.6,"BENZIN",126,null,"6d-TEMP-EVAP",5,103,null,140,null,"M6",4489,2058,1607,1442,"TCe 160","(6.6,150,117,160)",null,null,"Life, Zen, Intens,","Black Edition"]
["Skoda","Scala","1.0 TSI",null,null,18980,null,null,5.5,"BENZIN",126,null,"6d-TEMP",5,85,null,116,null,"M6",4363,2078,1601,1313,"1.4 TSI","(6.4,145,110,150)",null,null,"Reference, Style,","Xcellence"]
["Ford","Focus Turnier","1.0 EcoBoost",null,null,23600,null,null,5.3,"BENZIN",119,null,"6d",5,96,null,131,null,"M6",4641,2098,1646,1410,null,null,null,null,"Allure, Active,","Access, GT Line",null,"Auch als 7-Sitzer","erhältlich"]
["Skoda","Octavia Combi","1.0 TSI",null,null,26880,null,null,5.3,"BENZIN",120,null,"6d-TEMP",5,96,null,131,null,"M6",4294,1772,1605,1243,null,null,null,null,"Comfort, Elegance,","Executive"]
["Opel","Astra ST","1.2 Turbo","Direct Injection",null,23339,null,null,5.4,"BENZIN",122,null,"6d-TEMP",5,96,null,131,null,"M6",4500,2099,1654,1468,null,null,null,null,"Live, Feel"]
["Hyundai","i30 Combi","1.0 T-GDI",null,null,20590,null,null,5.4,"BENZIN",123,null,"6d-TEMP",5,85,null,115,null,"M6",4406,2128,1653,1528,"TCe 140","(6.8,153,103,140)","TCe 160","(6.9,155,117,160)","Zen, Intens, Limited,","Bose, Initiale"]
["VW","Golf Variant","1.0 TSI",null,null,25570,null,null,5.6,"BENZIN",126,null,"6d-TEMP",5,110,null,150,null,"M6",4854,2081,1720,1695,null,null,null,null,"Executive,","Xcellence, FR",null,"Auch als 7-Sitzer","erhältlich"]
["KIA","Ceed SW","1.0 TGDI GPF ISG",null,null,18990,null,null,5.6,"BENZIN",127,null,"6d-TEMP",5,75,null,102,null,"M6",4060,1960,1433,1165,null,null,null,null,"Edition, GS-Line,","Elegance"]
["Honda","Civic","1.0 VTEC","Turbo",null,22890,null,null,5.7,"BENZIN",128,null,"6d-TEMP-EVAP-ISC",5,85,null,115,null,"M6",4284,1789,1491,1380,null,null,null,null,"Rabbit, Life, Style"]
["Dacia","Logan MCV","SCe 75 S&S",null,null,8590,null,null,5.7,"BENZIN",129,null,"6d-TEMP",5,75,null,102,null,"M6",4055,1960,1430,1165,null,null,null,null,"Like, Active,","Allure, GT Line"]
["Mercedes","A-Klasse","A 180",null,null,29670,null,null,5.9,"BENZIN",133,null,"6d-TEMP",5,63,null,85,null,"M6",4050,1988,1440,1277,"Blue dCi 115","(4.2,110,85,115)",null,null,"Life, Zen, Intens,","RS Line",null,null,"Auch als Clio","Grandtour erhältlich"]
["VW","Passat","1.5 TSI ACT",null,null,32590,null,null,5.8,"BENZIN",133,null,"6d-TEMP-EVAP-ISC",5,63,null,85,null,"M6",4040,1735,1476,1194,null,null,null,null,"Trend, Titanium","Cool&Connect,","ST-Line",null,"Auch als 5-Türer","erhältlich"]
["Peugeot","308 SW","PureTech 130","Start&Stop",null,23600,null,null,5.9,"BENZIN",134,null,"6d",5,77,null,105,null,"M6",4370,2042,1485,1371,"1.5 CDTI","(4.4,116,90,122)",null,null,"Edition, GS-Line,","Elegance, Ultimate"]
["Renault","Megane Grandtour","TCe 115",null,null,19290,null,null,5.9,"BENZIN",135,null,"6d-TEMP",5,85,null,115,null,"M6",4313,1785,1426,1360,"35 TDI","(4.4,115,110,150)",null,null,"sport, design"]
["Opel","Insignia","1.5 Turbo","Direct Injection",null,30730,null,null,6.1,"BENZIN",138,null,"6d-TEMP",5,55,null,75,null,"M5",4069,1994,1555,1190,"dCi 95","(4.4,116,70,95)",null,null,"Comfort, Stepway,","Celebration"]
["Toyota","Corolla Kombi","1.2 Turbo",null,null,22290,null,null,6.2,"BENZIN",140,null,"6d-TEMP-EVAP-ISC",5,70,null,95,null,"M6",4378,1825,1454,1363,"1.5 EcoBlue","(4.5,117,88,120)","2.0 EcoBlue","(4.7,124,110,150)","Trend, Titanium","ST-Line, Vignale,","Active,","Cool&Connect","Auch als Turnier","erhältlich"]
["Skoda","Superb","1.5 TSI",null,null,33840,null,null,6.2,"BENZIN",141,null,"6d-TEMP",5,85,null,115,null,"M6",4359,2058,1447,1315,null,null,null,null,"Life, Zen, Intens,","Edition One, RS Line"]
["Peugeot",508,"PureTech 180",null,null,42250,null,null,6.5,"BENZIN",145,null,"6d",5,85,null,115,null,"M6",4319,1799,1434,1375,"118d","(4.7,122,11,150)"]
["Suzuki","Ignis","1.2 Dualjet AGS",null,null,16390,null,null,5.6,"BENZIN",126,null,"6d-TEMP",5,75,null,102,null,"M6",4170,1979,1480,1148,"BlueHDi 120","(5.0, 130, 88, 120)",null,null,"Feel, Shine"]
["Seat","Arona","1.0 Eco TSI",null,null,16690,null,null,5.6,"BENZIN",128,null,"6d-TEMP-EVAP-ISC",5,88,null,120,null,"M6",4186,1930,1536,1280,null,null,null,null,"Titanium, ST-Line"]
["Dacia","Sandero","SCe 75",null,null,7790,null,null,5.7,"BENZIN",129,null,"6d-TEMP-EVAP",5,85,null,115,null,"M6",4340,1795,1455,1313,null,null,null,null,"Level 2,3,4,5,6",null,null,null,"Auch als Combi","erhältlich"]
["Fiat","Panda","1.2 Fire 70",null,null,12100,null,null,5.7,"BENZIN",133,null,"6d-TEMP-EVAP-ISC",5,70,null,95,null,"M6",4419,1796,1440,1425,"A180d","(4.5,118,85,116)","A200d","(4.8,125,110,150)"]
["VW","T-Cross","1.0 TSI",null,null,19790,null,null,5.9,"BENZIN",133,null,"6d-TEMP",5,75,null,102,null,"M6",4253,2043,1457,1205,"1.5 BlueHDi 130","(4.5,119,96,131)",null,null,"Active, Allure, Access,","GT-Line, Style"]
["Ford","EcoSport","1.0 EcoBoost",null,null,20300,null,null,5.9,"BENZIN",134,null,"6d",5,77,null,105,null,"M6",4702,2042,1485,1395,"1.5 CDTI","(4.4,116,90,122)",null,null,"Astra, Edition,","GS Line, Elegance,","Ultimate"]
["Renault","Captur","TCe 100",null,null,18540,null,null,5.9,"BENZIN",134,null,"6d-TEMP-EVAP-ISC",5,85,null,116,null,"M6",4689,1994,1468,1370,"2.0 TDI","(4.6,122,110,150)",null,null,"Business, Premium"]
["Nissan","Juke","DIG-T 117",null,null,19600,null,null,5.9,"BENZIN",135,null,"6d-TEMP-EVAP",5,85,null,116,null,"M6",4585,2039,1465,1370,"1.6 CRDi","(4.6,120,100,136)",null,null,"Level 2,3,4,5,6"]
["Citroen","C3 Aircross","PureTech 110","S&S",null,20320,null,null,6.2,"BENZIN",141,null,"6d-TEMP-EVAP-ISC",5,85,null,116,null,"M6",4688,1830,1439,1470,"200d","(4.8,125,110,150)","220d","(4.8,127,140,190)"]
["Hyundai","Kona","1.0 T-GDi",null,null,20690,null,null,6.2,"BENZIN",142,null,"6d-TEMP",5,85,null,116,null,"M6",4626,2058,1449,1315,null,null,null,null,"Limited, Intens,","Bose, GT-Line"]
["Suzuki","Vitara","1.4 DITC",null,null,26490,null,null,7.4,"BENZIN",167,null,"6d-TEMP-EVAP-ISC",5,70,null,95,null,"M6",4668,1979,1494,1413,"1.5 EcoBlue","(4.5,119,88,120)","2.0 EcoBlue","(4.7,124,110,150)","Trend, Titanium,","ST-Line, Vignale,","Active,","Cool&Connect"]
["VW","Golf Sportsvan","1.0 TSI ",null,null,27420,null,null,5.9,"BENZIN",133,null,"6d-TEMP-EVAP",5,70,null,95,null,"M5",4571,1792,1514,1395,"MultiJet 120 SCR","(5.1,130,88,120)",null,null,"Street, Mirror,","Lounge, S-Design"]
["Dacia","Duster","TCe 100",null,null,12990,null,null,6.1,"BENZIN",138,null,"6d-TEMP",5,96,null,130,null,"M6",4750,2079,1403,1415,"BlueHDI 160","(5.5,144,120,163),","BlueHDI 180","(5.7,150,130,177)","Active, Allure,","GT Line, GT",null,null,"Auch als Combi","erhältlich"]
["Opel","Crossland X","1.2l",null,null,19839,null,null,6.2,"BENZIN",139,null,"6d-TEMP",5,88,null,120,null,"M6",4518,2079,1434,1342,null,null,null,null,"Elegance, Executive,","S, Comfort"]
["Skoda","Karoq","1.0 TSI",null,null,23980,null,null,6.3,"BENZIN",142,null,"6d-TEMP-EVAP",5,85,null,116,null,"M6",4600,1800,1465,1350,"1.6 CRDi ISG","(4.8,125,100,136)",null,null,"Gold, Silber","Titan, Platin,","GT-Line"]
["Citroen","Grand C4 Spacetourer","PureTech 130","Start&Stop",null,28550,null,null,6.3,"BENZIN",143,null,"6d-TEMP",5,90,null,122,null,"M6",4897,2093,1455,1503,"2.0 CDTI","(4.7,122,128,174)",null,null,"Edition, Business","Elegance",null,null,"Auch als Combi","erhältlich"]
["Peugeot",3008,"PureTech 130",null,null,26790,null,null,6.3,"BENZIN",144,null,"6d-TEMP",5,96,null,130,null,"M6",4585,2043,1472,1205,null,null,null,null,"Active, Allure,","GT Line, Access,","Style"]
["Opel","Grandland X","1.2 Turbo",null,null,26729,null,null,6.4,"BENZIN",145,null,"6d-TEMP-EVAP-ISC",5,110,null,150,null,"M6",4775,2083,1483,1525,"1.6 TDI","(5.4,141,88,120)",null,null,"Business, Elegance",null,null,null,"Auch als Passat","Variant erhältlich"]
["BMW","2er Gran Tourer","216i",null,null,31350,null,null,6.4,"BENZIN",146,null,"6d-TEMP",5,110,null,150,null,"M6",4709,2068,1435,1520,"320d","(4.9,128,140,190)",null,null,null,null,null,null,"Auch als Combi","erhältlich"]
["Renault","Kadjar","TCe 140",null,null,22890,null,null,6.5,"BENZIN",146,null,"6d-ISC-FCM",5,118,null,160,null,"M6",4686,1810,1442,1555,"180d","(5.0,130,90,122)","220d","(5.0,132,143,194)",null,null,null,null,"Auch als Combi","erhältlich"]
["Seat","Ateca","1.0 Eco TSI",null,null,16690,null,null,6.5,"BENZIN",146,null,"6d-TEMP",5,90,null,122,null,"M6",4762,2022,1428,1540,"35 TDI","(5.0,131,120,163)","40 TDI","(5.2,136,140,190)","advanced, S line",null,null,null,"Auch als Combi","erhältlich"]
["Peugeot",5008,"PureTech 130",null,null,28790,null,null,6.5,"BENZIN",147,null,"6d-TEMP",5,88,null,120,null,"M6",4871,2121,1482,1707,"2.0l EcoBlue","(5.0,131,110,150)","2.0l EcoBlue","(5.3,140,140,190)","Trend, Titanium,","ST-Line, Vignale"]
["Honda","HR-V","1,5 i-VTEC",null,null,23290,null,null,6.6,"BENZIN",148,null,"6d-TEMP",5,75,null,100,null,"M6",4300,1987,1530,1205,"BlueHDi 130","(4.9,129,96,130)",null,null,"Allure, Active,","GT-Line","Länge entspricht","Kompakt-Van"]
["Citroen","C5 Aircross","PureTech 130","Start&Stop",null,26690,null,null,6.6,"BENZIN",149,null,"6d",5,85,null,116,null,"M6",4354,2039,1555,1495,"218d","(4.9,129,110,150)","220d","(5.1,134,140,190)",null,null,"Länge entspricht","Kompakt-Van"]
["Renault","Scenic","TCe 115",null,null,21390,null,null,6.6,"BENZIN",149,null,"6d-TEMP",5,75,null,102,null,"M6",4154,1976,1597,1292,"Blue HDi 120","(5.2,137,88,120)",null,null,"Feel, Shine"]
["Seat","Alhambra","1.4 TSI",null,null,40130,null,null,6.5,"BENZIN",150,null,"6d-TEMP",5,85,null,115,null,"M6",4227,2003,1576,1490,null,null,null,null,"Life, Zen,","Intens, Edition One","Länge entspricht","Kompakt-Van"]
["Opel","Corsa","2021-05-01",null,null,20389,null,null,4.0999999999999996,"BENZIN",107,null,"6d-TEMP",5,70,null,95,null,"M5",4138,1942,1543,1297,null,null,null,null,"Reference, Style,","Xcellence"]
["VW","Golf","2.0 TDI",null,null,29390,null,null,4.0999999999999996,"BENZIN",107,null,"6d-TEMP-EVAP-ISC",5,70,null,95,null,"M5",4264,2025,1595,1320,"1.6 MultiJet","(5.2,137,88,120)",null,null,"Lounge, Cross, Sport",null,"Länge entspricht","Kompakt-Van"]
["Peugeot",208,"BlueHDi 100","Start&Stop",null,19530,null,null,4.0999999999999996,"BENZIN",108,null,"6d-TEMP-EVAP-ISC",5,74,null,100,null,"M6",4096,2057,1653,1395,"1.5 EcoBlue","(5.3,138,88,120)",null,null,"ST-Line, Titanium","Cool&Connect","Höhe entspricht","Kompakt-Van"]
["Renault","Clio","Blue dCi 85",null,null,18790,null,null,4.2,"BENZIN",109,null,"6d-TEMP-EVAP",5,85,null,116,null,"M6",4165,2070,1550,1318,"1.6 CRDi","(5.1,134,100,136)",null,null,"Level 2,3,4,6"]
["Ford","Fiesta","1.5 TDCi","Start&Stop",null,16650,null,null,4.2,"BENZIN",111,null,"6d-TEMP",5,85,null,116,null,"M6",4299,1822,1557,1505,"Cooper D","(5.0,130,110,150)","Cooper SD","(5.3,139,140,190)","One, Cooper",null,"Länge entspricht","Kompakt-Van"]
["Opel","Astra","1.5 CDTI",null,null,23739,null,null,4.3,"BENZIN",112,null,"6d-TEMP-EVAP-ISC",5,85,null,115,null,"M6",4241,1988,1553,1336,null,null,null,null,"Active, Ambition","Style, Monte Carlo"]
["Audi","A3 SB","30 TDI",null,null,29600,null,null,4.4000000000000004,"BENZIN",114,null,"6d-TEMP-EVAP-ISC",5,85,null,115,null,"M6",4234,1992,1573,1395,"2,0 TDI","(5.4,141,110,150)",null,null,"T-Roc, Design, Sport"]
["Dacia","Sandero","Blue dCi 75","S&S",null,11340,null,null,4.4000000000000004,"BENZIN",116,null,"6d-TEMP-EVAP-ISC",5,55,null,75,null,"M6",4157,2112,1741,1420,"1.5 TDCi SS","(5.5,144,74,101)",null,null,"Trend, Titanium, Sport",null,"Höhe entspricht","Kompakt-Van"]
["Ford","Focus","1.5 l EcoBlue",null,null,23650,null,null,4.5,"BENZIN",117,null,"6d-TEMP",5,75,null,102,null,"M6",4212,1976,1605,1289,"1.5 CDTI","(5.2,137,88,120)",null,null,"Edition, Innovation,","Ultimate"]
["Renault","Megane","Blue dCi 115",null,null,24090,null,null,4.5,"BENZIN",117,null,"6d-TEMP",5,70,null,95,null,"M6",4498,2004,1682,1263,"Blue dCi 115","(4.8,126,85,115)",null,null,"Supreme, Stepway",null,null,"Auch als 7-Sitzer","erhältlich"]
["BMW","1er Limousine","116d",null,null,31160,null,null,4.5,"BENZIN",118,null,"6d",5,85,null,116,null,"M6",4565,2038,1606,1560,"218d","(5.1,134,110,150)","220d","(5.3,140,140,190)",null,null,null,"Auch als 7-Sitzer","erhältlich"]
["Citroen","C4 Cactus","BlueHDi 100","S&S",null,20275,null,null,4.5,"BENZIN",118,null,"6d-TEMP",5,70,null,95,null,"M6",4341,2052,1693,1314,"Blue dCi 115","(4.9,128,85,115)",null,null,"Essential, Comfort,","Prestige, Celebration"]
["Ford","Puma","1.5 l EcoBlue",null,null,25890,null,null,4.5,"BENZIN",118,null,"6d-TEMP",5,96,null,130,null,"M6",4438,1826,1610,1410,null,null,null,null,"Feel",null,null,"Auch als Grand","Spacetourer erhältlich"]
["Hyundai","i30","1.6 CRDi",null,null,22590,null,null,4.5999999999999996,"BENZIN",118,null,"6d-TEMP",5,85,null,115,null,"M6",4489,2058,1613,1531,"Blue dCi 150","(5.5,145,110,150)",null,null,"Zen, Intens,","Black Edition"]
["Mercedes","A-Klasse","160 d",null,null,29590,null,null,4.5,"BENZIN",118,null,"6d-TEMP",5,70,null,95,null,"M6",4363,2004,1804,1368,null,null,null,null,"Supreme, Stepway"]
["Peugeot",308,"BlueHDi 100",null,null,23850,null,null,4.5,"BENZIN",118,null,"6d-TEMP",5,88,null,120,null,"M6",4294,1772,1689,1395,null,null,null,null,"Comfort. Elegance,","Executive"]
["Opel","Astra Sports Tourer","1.5 CDTI",null,null,25339,null,null,4.3,"BENZIN",113,null,"6d-TEMP-EVAP",5,85,null,116,null,"M6",4485,1855,1635,1534,"1.6 CRDI SCR","(5.4,141,100,136)",null,null,"Titan, Silber,","Gold, Platin,","GT-Line"]
["Skoda","Octavia Combi","2.0 l TDI",null,null,29970,null,null,4.4000000000000004,"BENZIN",117,null,"6d-TEMP",5,96,null,130,null,"A8",4573,2098,1625,1527,"BlueHDI 180","(6.1,161,130,180)",null,null,"Be Chic, So Chic,","Performance Line"]
["Hyundai","i30 CW","1.6 CRDi",null,null,22590,null,null,4.5,"BENZIN",118,null,"6d-TEMP",5,96,null,130,null,"M6",4477,2098,1609,1435,null,null,null,null,"Edition, Innovation,","Ultimate"]
["Mercedes","CLA-Klasse","180 d",null,null,35460,null,null,4.5,"BENZIN",118,null,"6d-TEMP",5,96,null,130,null,"M6",4447,2098,1624,1417,"BlueHDI 180","(6.1,162,130,180)",null,null,"Allure, GT Line,","Active, Crossway"]
["Renault","Megane Grandtour","Blue dCi 115",null,null,25090,null,null,4.5,"BENZIN",118,null,"6d-TEMP-EVAP-ISC",5,85,null,116,null,"M5",4351,2050,1613,1440,"2.0 TDI","(5.4,142,110,150)",null,null,"Comfortline,","Highline"]
["Ford","Focus Turnier","1.5 EcoBlue",null,null,25150,null,null,4.5,"BENZIN",119,null,"6d-TEMP",5,96,null,130,null,"M6",4641,2098,1646,1430,null,null,null,null,"Allure, GT Line,","Active, Crossway",null,"Auch als 7-Sitzer","erhältlich"]
["Fiat","Tipo Kombi","MultiJet 95 SCR",null,null,21170,null,null,4.5999999999999996,"BENZIN",120,null,"6d-TEMP",5,96,null,130,null,"M6",4500,1969,1654,1507,null,null,null,null,"Live, Feel,","Shine, C-Series"]
["Peugeot",508,"BlueHDi 130",null,null,36750,null,null,4.7,"BENZIN",120,null,"6d-TEMP",5,85,null,116,null,"M6",4363,2078,1601,1428,"2.0 TDI","(5.4,142,110,150)",null,null,"Reference, Style,","Xcellence"]
["Honda","Civic","1.6i-DTEC",null,null,24390,null,null,4.5999999999999996,"BENZIN",121,null,"6d-TEMP",5,75,null,102,null,"M5",3996,2009,1474,1146,null,null,null,"Feel, Shine"]
["KIA","ceed SW","1.6 CRDi ISG",null,null,22790,null,null,4.5999999999999996,"BENZIN",121,null,"6d-TEMP",5,75,null,102,null,"M6","4 060","1 960","1 433","1 165",null,null,null,null,"Edition, GS-Line,","Elegance"]
["Opel","Insignia ","1.5 CDTI",null,null,32699,null,null,4.5999999999999996,"BENZIN",121,null,"6d-TEMP-EVAP-ISC",5,85,null,115,null,"M6","4 284","1 789","1 491","1 380",null,null,null,null,"Rabbit, Life, Style"]
["Peugeot","308 SW","BlueHDi 130",null,null,27800,null,null,4.7,"BENZIN",122,null,"6d-TEMP",5,75,null,102,null,"M6","4 055","1 960","1 430","1 165",null,null,null,null,"Like, Active,","Allure, GT Line"]
["VW","Passat Limousine","2.0 TDI",null,null,36659,null,null,4.7,"BENZIN",122,null,"6d-TEMP",5,63,null,85,null,"M6","4 050","1 988","1 440","1 277","Blue dCi 115","(4.2,110,85,115)",null,null,"Life, Zen, Intens,","RS Line",null,null,"Auch als Clio","Grandtour erhältlich"]
["BMW","3er Limousine","318d",null,null,38950,null,null,4.8,"BENZIN",125,null,"6d-TEMP-EVAP-ISC",5,63,null,85,null,"M6","4 040","1 735","1 476","1 194",null,null,null,null,"Trend, Titanium","Cool&Connect,","ST-Line",null,"Auch als 5-Türer","erhältlich"]
["Mercedes","C-Klasse","200 d",null,null,40470,null,null,4.8,"BENZIN",127,null,"6d",5,77,null,105,null,"M6","4 370","2 042","1 485","1 371","1.5 CDTI","(4.4,116,90,122)",null,null,"Edition, GS-Line,","Elegance, Ultimate"]
["Audi","A4 Limousine","30 TDI",null,null,36970,null,null,4.9000000000000004,"BENZIN",128,null,"6d-TEMP",5,85,null,115,null,"M6","4 313","1 785","1 426","1 360","35 TDI","(4.4,115,110,150)",null,null,"sport, design"]
["Ford","Mondeo","2.0l EcoBlue SCR",null,null,34100,null,null,4.9000000000000004,"BENZIN",128,null,"6d-TEMP",5,55,null,75,null,"M5","4 069","1 994","1 555","1 190","dCi 95","(4.4,116,70,95)",null,null,"Comfort, Stepway,","Celebration"]
["Peugeot",2008,"BlueHDi 100",null,null,25510,null,null,4.5,"BENZIN",118,null,"6d-TEMP-EVAP-ISC",5,70,null,95,null,"M6","4 378","1 825","1 454","1 363","1.5 EcoBlue","(4.5,117,88,120)","2.0 EcoBlue","(4.7,124,110,150)","Trend, Titanium","ST-Line, Vignale,","Active,","Cool&Connect","Auch als Turnier","erhältlich"]
["BMW","2er Active Tourer","216d",null,null,32050,null,null,4.7,"BENZIN",123,null,"6d-TEMP",5,85,null,115,null,"M6","4 359","2 058","1 447","1 315",null,null,null,null,"Life, Zen, Intens,","Edition One, RS Line"]
["Citroen","C3 Aircross","Blue HDi 100","S&S",null,20790,null,null,4.7,"BENZIN",123,null,"6d",5,85,null,115,null,"M6","4 319","1 799","1 434","1 375","118d","(4.7,122,11,150)"]
["Renault","Captur","Blue dCi 115",null,null,24890,null,null,4.7,"BENZIN",123,null,"6d-TEMP",5,75,null,102,null,"M6","4 170","1 979","1 480","1 148","BlueHDi 120","(5.0, 130, 88, 120)",null,null,"Feel, Shine"]
["Seat","Arona","1.6 TDI",null,null,19990,null,null,4.8,"BENZIN",125,null,"6d-TEMP-EVAP-ISC",5,88,null,120,null,"M6","4 186","1 930","1 536","1 280",null,null,null,null,"Titanium, ST-Line"]
["Fiat","500X Urban","1.6 MultiJet","95 SCR",null,22100,null,null,4.8,"BENZIN",126,null,"6d-TEMP-EVAP",5,85,null,115,null,"M6","4 340","1 795","1 455","1 313",null,null,null,null,"Level 2,3,4,5,6",null,null,null,"Auch als Combi","erhältlich"]
["Ford","EcoSport","1.5 l EcoBlue",null,null,23700,null,null,4.9000000000000004,"BENZIN",129,null,"6d-TEMP-EVAP-ISC",5,70,null,95,null,"M6","4 419","1 796","1 440","1 425","A180d","(4.5,118,85,116)","A200d","(4.8,125,110,150)"]
["Hyundai","Kona","1.6 CRDi",null,null,22690,null,null,5,"BENZIN",129,null,"6d-TEMP",5,75,null,102,null,"M6","4 253","2 043","1 457","1 205","1.5 BlueHDi 130","(4.5,119,96,131)",null,null,"Active, Allure, Access,","GT-Line, Style"]
["Mini","Countryman","One",null,null,28500,null,null,4.9000000000000004,"BENZIN",129,null,"6d",5,77,null,105,null,"M6","4 702","2 042","1 485","1 395","1.5 CDTI","(4.4,116,90,122)",null,null,"Astra, Edition,","GS Line, Elegance,","Ultimate"]
["Skoda","Kamiq","1.6l TDI ",null,null,24050,null,null,5,"BENZIN",131,null,"6d-TEMP-EVAP-ISC",5,85,null,116,null,"M6","4 689","1 994","1 468","1 370","2.0 TDI","(4.6,122,110,150)",null,null,"Business, Premium"]
["VW","T-Roc","1,6 TDI",null,null,25770,null,null,5.2,"BENZIN",136,null,"6d-TEMP-EVAP",5,85,null,116,null,"M6","4 585","2 039","1 465","1 370","1.6 CRDi","(4.6,120,100,136)",null,null,"Level 2,3,4,5,6"]
["Ford","Tourneo Courier","1.5 TDCi S&S",null,null,18142,null,null,5.4,"BENZIN",141,null,"6d-TEMP-EVAP-ISC",5,85,null,116,null,"M6","4 688","1 830","1 439","1 470","200d","(4.8,125,110,150)","220d","(4.8,127,140,190)"]
["Opel","Crossland X","1.5 CDTI",null,null,22349,null,null,4.7,"BENZIN",123,null,"6d-TEMP",5,85,null,116,null,"M6","4 626","2 058","1 449","1 315",null,null,null,null,"Limited, Intens,","Bose, GT-Line"]
["Dacia","Lodgy","Blue dCi 95",null,null,15350,null,null,4.8,"BENZIN",126,null,"6d-TEMP-EVAP-ISC",5,70,null,95,null,"M6","4 668","1 979","1 494","1 413","1.5 EcoBlue","(4.5,119,88,120)","2.0 EcoBlue","(4.7,124,110,150)","Trend, Titanium,","ST-Line, Vignale,","Active,","Cool&Connect"]
["BMW","2er Gran Tourer","216d",null,null,33600,null,null,4.9000000000000004,"BENZIN",128,null,"6d-TEMP-EVAP",5,70,null,95,null,"M5","4 571","1 792","1 514","1 395","MultiJet 120 SCR","(5.1,130,88,120)",null,null,"Street, Mirror,","Lounge, S-Design"]
["Dacia","Duster","Blue dCi 95",null,null,15490,null,null,4.9000000000000004,"BENZIN",128,null,"6d-TEMP",5,96,null,130,null,"M6","4 750","2 079","1 403","1 415","BlueHDI 160","(5.5,144,120,163),","BlueHDI 180","(5.7,150,130,177)","Active, Allure,","GT Line, GT",null,null,"Auch als Combi","erhältlich"]
["Citroen","C4 Spacetourer","BlueHDi 130","Start&Stop",null,28400,null,null,5,"BENZIN",130,null,"6d-TEMP",5,88,null,120,null,"M6","4 518","2 079","1 434","1 342",null,null,null,null,"Elegance, Executive,","S, Comfort"]
["Renault","Kadjar","Blue dCi 115",null,null,27090,null,null,5,"BENZIN",131,null,"6d-TEMP-EVAP",5,85,null,116,null,"M6","4 600","1 800","1 465","1 350","1.6 CRDi ISG","(4.8,125,100,136)",null,null,"Gold, Silber","Titan, Platin,","GT-Line"]
["Dacia","Dokker","Blue dCi 95",null,null,14250,null,null,5,"BENZIN",132,null,"6d-TEMP",5,90,null,122,null,"M6","4 897","2 093","1 455","1 503","2.0 CDTI","(4.7,122,128,174)",null,null,"Edition, Business","Elegance",null,null,"Auch als Combi","erhältlich"]
["Honda","HR-V","1.6 i-DTEC",null,null,25790,null,null,5,"BENZIN",132,null,"6d-TEMP",5,96,null,130,null,"M6","4 585","2 043","1 472","1 205",null,null,null,null,"Active, Allure,","GT Line, Access,","Style"]
["KIA","Sportage","1.6 CRDI SCR",null,null,31190,null,null,5.3,"BENZIN",135,null,"6d-TEMP-EVAP-ISC",5,110,null,150,null,"M6","4 775","2 083","1 483","1 525","1.6 TDI","(5.4,141,88,120)",null,null,"Business, Elegance",null,null,null,"Auch als Passat","Variant erhältlich"]
["DS Automobiles","DS 7","BlueHDi 130",null,null,41290,null,null,5.2,"BENZIN",136,null,"6d-TEMP",5,110,null,150,null,"M6","4 709","2 068","1 435","1 520","320d","(4.9,128,140,190)",null,null,null,null,null,null,"Auch als Combi","erhältlich"]
["Opel","Grandland X","1.5 CDTI",null,null,29309,null,null,5.2,"BENZIN",136,null,"6d-ISC-FCM",5,118,null,160,null,"M6","4 686","1 810","1 442","1 555","180d","(5.0,130,90,122)","220d","(5.0,132,143,194)",null,null,null,null,"Auch als Combi","erhältlich"]
["Peugeot",3008,"BlueHDi 130",null,null,33000,null,null,5.2,"BENZIN",136,null,"6d-TEMP",5,90,null,122,null,"M6","4 762","2 022","1 428","1 540","35 TDI","(5.0,131,120,163)","40 TDI","(5.2,136,140,190)","advanced, S line",null,null,null,"Auch als Combi","erhältlich"]
["VW","Golf Sportsvan","1.6 TDI",null,null,30120,null,null,5.2,"BENZIN",136,null,"6d-TEMP",5,88,null,120,null,"M6","4 871","2 121","1 482","1 707","2.0l EcoBlue","(5.0,131,110,150)","2.0l EcoBlue","(5.3,140,140,190)","Trend, Titanium,","ST-Line, Vignale"]
["Peugeot",5008,"BlueHDi 130",null,null,34900,null,null,5.3,"BENZIN",137,null,"6d-TEMP",5,75,null,100,null,"M6","4 300","1 987","1 530","1 205","BlueHDi 130","(4.9,129,96,130)",null,null,"Allure, Active,","GT-Line","Länge entspricht","Kompakt-Van"]
["Citroen","C5 Aircross","BlueHDi 130","Start&Stop",null,29390,null,null,5.2,"BENZIN",138,null,"6d",5,85,null,116,null,"M6","4 354","2 039","1 555","1 495","218d","(4.9,129,110,150)","220d","(5.1,134,140,190)",null,null,"Länge entspricht","Kompakt-Van"]
["Seat","Ateca","1.6 TDI",null,null,25880,null,null,5,"BENZIN",139,null,"6d-TEMP",5,75,null,102,null,"M6","4 154","1 976","1 597","1 292","Blue HDi 120","(5.2,137,88,120)",null,null,"Feel, Shine"]
["Citroen","C3","BlueHDi 100","Start&Stop",null,18290,null,null,4.5,"DIESEL",117,null,"6d-TEMP",5,85,null,115,null,"M6","4 227","2 003","1 576","1 490",null,null,null,null,"Life, Zen,","Intens, Edition One","Länge entspricht","Kompakt-Van"]
["Opel","Corsa","2021-05-01",null,null,"20 389",null,null,4.0999999999999996,"DIESEL",107,null,"6d-TEMP",5,70,null,95,null,"M5","4 138","1 942","1 543","1 297",null,null,null,null,"Reference, Style,","Xcellence"]
["VW","Golf","2.0 TDI",null,null,"29 390",null,null,4.0999999999999996,"DIESEL",107,null,"6d-TEMP-EVAP-ISC",5,70,null,95,null,"M5","4 264","2 025","1 595","1 320","1.6 MultiJet","(5.2,137,88,120)",null,null,"Lounge, Cross, Sport",null,"Länge entspricht","Kompakt-Van"]
["Peugeot",208,"BlueHDi 100","Start&Stop",null,"19 530",null,null,4.0999999999999996,"DIESEL",108,null,"6d-TEMP-EVAP-ISC",5,74,null,100,null,"M6","4 096","2 057","1 653","1 395","1.5 EcoBlue","(5.3,138,88,120)",null,null,"ST-Line, Titanium","Cool&Connect","Höhe entspricht","Kompakt-Van"]
["Renault","Clio","Blue dCi 85",null,null,"18 790",null,null,4.2,"DIESEL",109,null,"6d-TEMP-EVAP",5,85,null,116,null,"M6","4 165","2 070","1 550","1 318","1.6 CRDi","(5.1,134,100,136)",null,null,"Level 2,3,4,6"]
["Ford","Fiesta","1.5 TDCi","Start&Stop",null,"16 650",null,null,4.2,"DIESEL",111,null,"6d-TEMP",5,85,null,116,null,"M6","4 299","1 822","1 557","1 505","Cooper D","(5.0,130,110,150)","Cooper SD","(5.3,139,140,190)","One, Cooper",null,"Länge entspricht","Kompakt-Van"]
["Opel","Astra","1.5 CDTI",null,null,"23 739",null,null,4.3,"DIESEL",112,null,"6d-TEMP-EVAP-ISC",5,85,null,115,null,"M6","4 241","1 988","1 553","1 336",null,null,null,null,"Active, Ambition","Style, Monte Carlo"]
["Audi","A3 SB","30 TDI",null,null,"29 600",null,null,4.4000000000000004,"DIESEL",114,null,"6d-TEMP-EVAP-ISC",5,85,null,115,null,"M6","4 234","1 992","1 573","1 395","2,0 TDI","(5.4,141,110,150)",null,null,"T-Roc, Design, Sport"]
["Dacia","Sandero","Blue dCi 75","S&S",null,"11 340",null,null,4.4000000000000004,"DIESEL",116,null,"6d-TEMP-EVAP-ISC",5,55,null,75,null,"M6","4 157","2 112","1 741","1 420","1.5 TDCi SS","(5.5,144,74,101)",null,null,"Trend, Titanium, Sport",null,"Höhe entspricht","Kompakt-Van"]
["Ford","Focus","1.5 l EcoBlue",null,null,"23 650",null,null,4.5,"DIESEL",117]
["Renault","Megane","Blue dCi 115",null,null,"24 090",null,null,4.5,"DIESEL",117]
["BMW","1er Limousine","116d",null,null,"31 160",null,null,4.5,"DIESEL",118]
["Citroen","C4 Cactus","BlueHDi 100","S&S",null,"20 275",null,null,4.5,"DIESEL",118]
["Ford","Puma","1.5 l EcoBlue",null,null,"25 890",null,null,4.5,"DIESEL",118]
["Hyundai","i30","1.6 CRDi",null,null,"22 590",null,null,4.5999999999999996,"DIESEL",118]
["Mercedes","A-Klasse","160 d",null,null,"29 590",null,null,4.5,"DIESEL",118]
["Peugeot",308,"BlueHDi 100",null,null,"23 850",null,null,4.5,"DIESEL",118]
["Opel","Astra Sports Tourer","1.5 CDTI",null,null,"25 339",null,null,4.3,"DIESEL",113]
["Skoda","Octavia Combi","2.0 l TDI",null,null,"29 970",null,null,4.4000000000000004,"DIESEL",117]
["Hyundai","i30 CW","1.6 CRDi",null,null,"22 590",null,null,4.5,"DIESEL",118]
["Mercedes","CLA-Klasse","180 d",null,null,"35 460",null,null,4.5,"DIESEL",118]
["Renault","Megane Grandtour","Blue dCi 115",null,null,"25 090",null,null,4.5,"DIESEL",118]
["Ford","Focus Turnier","1.5 EcoBlue",null,null,"25 150",null,null,4.5,"DIESEL",119]
["Fiat","Tipo Kombi","MultiJet 95 SCR",null,null,"21 170",null,null,4.5999999999999996,"DIESEL",120]
["Peugeot",508,"BlueHDi 130",null,null,"36 750",null,null,4.7,"DIESEL",120]
["Honda","Civic","1.6i-DTEC",null,null,"24 390",null,null,4.5999999999999996,"DIESEL",121]
["KIA","ceed SW","1.6 CRDi ISG",null,null,"22 790",null,null,4.5999999999999996,"DIESEL",121]
["Opel","Insignia","1.5 CDTI",null,null,"32 699",null,null,4.5999999999999996,"DIESEL",121]
["Peugeot","308 SW","BlueHDi 130",null,null,"27 800",null,null,4.7,"DIESEL",122]
["VW","Passat Limousine","2.0 TDI",null,null,"36 659",null,null,4.7,"DIESEL",122]
["BMW","3er Limousine","318d",null,null,"38 950",null,null,4.8,"DIESEL",125]
["Mercedes","C-Klasse","200 d",null,null,"40 470",null,null,4.8,"DIESEL",127]
["Audi","A4 Limousine","30 TDI",null,null,"36 970",null,null,4.9000000000000004,"DIESEL",128]
["Ford","Mondeo","2.0l EcoBlue SCR",null,null,"34 100",null,null,4.9000000000000004,"DIESEL",128]
["Peugeot",2008,"BlueHDi 100",null,null,"25 510",null,null,4.5,"DIESEL",118]
["BMW","2er Active Tourer","216d",null,null,"32 050",null,null,4.7,"DIESEL",123]
["Citroen","C3 Aircross","Blue HDi 100","S&S",null,"20 790",null,null,4.7,"DIESEL",123]
["Renault","Captur","Blue dCi 115",null,null,"24 890",null,null,4.7,"DIESEL",123]
["Seat","Arona","1.6 TDI",null,null,"19 990",null,null,4.8,"DIESEL",125]
["Fiat","500X Urban","1.6 MultiJet","95 SCR",null,"22 100",null,null,4.8,"DIESEL",126]
["Ford","EcoSport","1.5 l EcoBlue",null,null,"23 700",null,null,4.9000000000000004,"DIESEL",129]
["Hyundai","Kona","1.6 CRDi",null,null,"22 690",null,null,5,"DIESEL",129]
["Mini","Countryman","One",null,null,"28 500",null,null,4.9000000000000004,"DIESEL",129]
["Skoda","Kamiq","1.6l TDI",null,null,"24 050",null,null,5,"DIESEL",131]
["VW","T-Roc","1,6 TDI",null,null,"25 770",null,null,5.2,"DIESEL",136]
["Ford","Tourneo Courier","1.5 TDCi S&S",null,null,"18 142",null,null,5.4,"DIESEL",141]

{"sheet":"Berechnungen","index":5,"n_rows":56,"n_cols":22,"rows_kept":56,"cut":false,"hidden":false,"merged":[[24,1,24,6]]}
[null,null,null,null,null,null,null,null,null,null,null,null,null,null,"Motorbezogene Versicherungssteuer für E-Autos ab 01. April 2025 (in Österreich)"]
[]
[null,"Jahre","Einnahmen","Ausgaben","Cash Flow","Barwerte","Kapitalwert","Zeit",null,null,null,null,null,null,"Gewähltes Modell","Leistung (max.)","Leistung (Dauer)","Leergewicht","Motorsteuer","Massensteuer","Gesamtsteuer","Steuer pro Jahr"]
[null,null,"[€]","[€]","[€]","[€]","[€]",null,null,null,null,null,null,null,null,"kW","kW","kg","EUR","EUR","EUR","EUR"]
[null,0,null,{"$f":"Eingabe!Q33*-1","v":1610},{"$f":"C5-D5","v":-1610},{"$f":"E5/(1+(Eingabe!G$77/100))^B5","v":-1610},{"$f":"F5","v":-1610},{"$f":"IF(G5<0,I5,0)","v":1},1,null,null,null,null,null,{"$f":"Eingabe!G12","v":"Cupra  Born"},{"$f":"VLOOKUP($O$5, 'Daten-Elektrofahrzeug'!$C$6:$Q$79, 'Daten-Elektrofahrzeug'!E5, FALSE)","v":150},{"$f":"IF(ISBLANK(Eingabe!I42), VLOOKUP($O$5, 'Daten-Elektrofahrzeug'!$C$6:$Q$79, 'Daten-Elektrofahrzeug'!P5, FALSE), Eingabe!I42)","v":115},{"$f":"IF(ISBLANK(Eingabe!I43), VLOOKUP($O$5,'Daten-Elektrofahrzeug'!$C$6:$Q$79,'Daten-Elektrofahrzeug'!Q5,FALSE), Eingabe!I43)","v":1840},{"$f":"IF((Dauerleistung-Freibetrag_kW)>(gw1_kW+gw2_kW), (Dauerleistung-Freibetrag_kW-(gw1_kW+gw2_kW))*Restwert_EURprokW+gw1_kW*gw1_EURprokW+gw2_kW*gw2_EURprokW, IF((Dauerleistung-Freibetrag_kW)>(gw1_kW), (Dauerleistung-Freibetrag_kW-gw1_kW)*gw2_EURprokW+gw1_kW*gw1_EURprokW, IF((Dauerleistung>Freibetrag_kW), Dauerleistung*gw1_EURprokW, 0)))","v":22},{"$f":"IF((Leergewicht-Freibetrag_kg)>(gw1_kg+gw2_kg), (Leergewicht-Freibetrag_kg-(gw1_kg+gw2_kg))*Restwert_EURprokg+gw1_kg*gw1_EURprokg+gw2_kg*gw2_EURprokg, IF((Leergewicht-Freibetrag_kg)>(gw1_kg), (Leergewicht-Freibetrag_kg-gw1_kg)*gw2_EURprokg+gw1_kg*gw1_EURprokg, IF((Leergewicht>Freibetrag_kg), Leergewicht*gw1_EURprokg, 0)))","v":20.7},{"$f":"S5+T5","v":42.7},{"$f":"U5*12","v":512.40000000000009}]
[null,1,{"$f":"E28+Eingabe!$Q$53","v":509.81252631578946},{"$f":"Eingabe!$G$68+IF(Eingabe!$G$34=B6,Eingabe!$G$35,0)","v":0},{"$f":"(C6-D6)/(1+(Eingabe!$G$74/100))^B6","v":500.30669903414082},{"$f":"E6/(1+(Eingabe!G$77/100))^B6","v":492.91300397452301},{"$f":"G5+F6","v":-1117.086996025477},{"$f":"IF(G6<0,I6,0)","v":2},2]
[null,2,{"$f":"E29+Eingabe!$Q$53","v":514.85979421052627},{"$f":"Eingabe!$G$68+IF(Eingabe!$G$34=B7,Eingabe!$G$35,0)","v":0},{"$f":"(C7-D7)/(1+(Eingabe!$G$74/100))^B7","v":495.83891749644522},{"$f":"E7/(1+(Eingabe!G$77/100))^B7","v":481.29187070440474},-635.79512532107219,{"$f":"IF(G7<0,I7,0)","v":3},3]
[null,3,{"$f":"E30+Eingabe!$Q$53","v":520.01998072368428},{"$f":"Eingabe!$G$68+IF(Eingabe!$G$34=B8,Eingabe!$G$35,0)","v":0},{"$f":"(C8-D8)/(1+(Eingabe!$G$74/100))^B8","v":491.4705271016914},{"$f":"E8/(1+(Eingabe!G$77/100))^B8","v":470.00161699020657},-165.79350833086562,4,4,null,null,null,null,null,"Tabellen Steuergrenzen und Kosten"]
[null,4,{"$f":"E31+Eingabe!$Q$53","v":525.29552382653947},{"$f":"Eingabe!$G$68+IF(Eingabe!$G$34=B9,Eingabe!$G$35,0)","v":0},{"$f":"(C9-D9)/(1+(Eingabe!$G$74/100))^B9","v":487.1996459957993},{"$f":"E9/(1+(Eingabe!G$77/100))^B9","v":459.03182345851678},293.23831512765116,0,5]
[null,5,{"$f":"E32+Eingabe!$Q$53","v":530.68891294377761},{"$f":"Eingabe!$G$68+IF(Eingabe!$G$34=B10,Eingabe!$G$35,0)","v":0},{"$f":"(C10-D10)/(1+(Eingabe!$G$74/100))^B10","v":483.02442755950068},{"$f":"E10/(1+(Eingabe!G$77/100))^B10","v":448.37241230525507},741.61072743290629,0,6,null,null,null,null,null,null,"Freibetrag","Grenzwert 1","Grenzwert 2","Restwert"]
[null,6,{"$f":"E33+Eingabe!$Q$53","v":536.20269002297118},{"$f":"Eingabe!$G$68+IF(Eingabe!$G$34=B11,Eingabe!$G$35,0)","v":0},{"$f":"(C11-D11)/(1+(Eingabe!$G$74/100))^B11","v":478.94305975081846},{"$f":"E11/(1+(Eingabe!G$77/100))^B11","v":438.01363595573173},1179.6243633886379,0,7,null,null,null,null,null,"Leistung in kW",45,35,25]
[null,7,{"$f":"E34+Eingabe!$Q$53","v":541.83945062605324},{"$f":"Eingabe!$G$68+IF(Eingabe!$G$34=B12,Eingabe!$G$35,0)","v":0},{"$f":"(C12-D12)/(1+(Eingabe!$G$74/100))^B12","v":474.95376445980975},{"$f":"E12/(1+(Eingabe!G$77/100))^B12","v":427.94606610215908},1607.5704294907969,0,8,null,null,null,null,null,"EUR pro kW",0,0.25,0.35,0.45]
[null,8,{"$f":"E35+Eingabe!$Q$53","v":547.60184504323638},{"$f":"Eingabe!$G$68+IF(Eingabe!$G$34=B13,Eingabe!$G$35,0)","v":0},{"$f":"(C13-D13)/(1+(Eingabe!$G$74/100))^B13","v":471.05479687534165},{"$f":"E13/(1+(Eingabe!G$77/100))^B13","v":418.16058310605541},2025.7310125968522,0,9]
[null,9,{"$f":"E36+Eingabe!$Q$53","v":553.49257942983309},{"$f":"Eingabe!$G$68+IF(Eingabe!$G$34=B14,Eingabe!$G$35,0)","v":2000},{"$f":"(C14-D14)/(1+(Eingabe!$G$74/100))^B14","v":-1221.1050009229184},{"$f":"E14/(1+(Eingabe!G$77/100))^B14","v":-1067.9689582741771},957.76205432267511,0,10,null,null,null,null,null,null,"Freibetrag","Grenzwert 1","Grenzwert 2","Restwert"]
[null,10,{"$f":"E37+Eingabe!$Q$53","v":559.5144169664477},{"$f":"Eingabe!$G$68+IF(Eingabe!$G$34=B15,Eingabe!$G$35,0)","v":0},{"$f":"(C15-D15)/(1+(Eingabe!$G$74/100))^B15","v":463.52102835864144},{"$f":"E15/(1+(Eingabe!G$77/100))^B15","v":399.40088135081083},1357.1629356734859,0,11,null,null,null,null,null,"Leergewicht in kg",900,500,700]
[null,11,{"$f":"E38+Eingabe!$Q$53","v":565.67017904301474},{"$f":"Eingabe!$G$68+IF(Eingabe!$G$34=B16,Eingabe!$G$35,0)","v":0},{"$f":"(C16-D16)/(1+(Eingabe!$G$74/100))^B16","v":459.88289876318419},{"$f":"E16/(1+(Eingabe!G$77/100))^B16","v":390.40987615137601},1747.5728118248619,0,12,null,null,null,null,null,"EUR pro kg",0,1.4999999999999999E-2,0.03,4.4999999999999998E-2]
[null,12,{"$f":"E39+Eingabe!$Q$53","v":571.96274646717188},{"$f":"Eingabe!$G$68+IF(Eingabe!$G$34=B17,Eingabe!$G$35,0)","v":0},{"$f":"(C17-D17)/(1+(Eingabe!$G$74/100))^B17","v":456.3284383620711},{"$f":"E17/(1+(Eingabe!G$77/100))^B17","v":381.66736609920503},2129.2401779240668,0,13]
[null,"Summen",{"$f":"SUM(C6:C17)","v":6476.960645619045},{"$f":"SUM(D5:D17)","v":3610},{"$f":"SUM(E5:E17)","v":2431.4192028345251},{"$f":"SUM(F5:F17)","v":2129.2401779240668},null,{"$f":"IF(MAX(H5:H17)>12,\">12\",MAX(H5:H17))","v":4}]
[]
[]
[null,null,null,null,null,null,null,"Mehreinnahmen nach 12 Jahren:",{"$f":"NPV(Eingabe!G$77/100,Berechnungen!E6:E17)+E5","v":2129.2401779240672}]
[null,null,null,null,null,null,null,"Interner Zinsfuß:",{"$f":"IRR(F5:F17)","v":0.22646836680969251}]
[]
[]
[null,"Entwicklung Kraftstoffpreise"]
[null,"Jahre","Strom","Benzin-/Diesel","DELTA","Strom","Benzin-/Diesel"]
[null,null,"[€]","[€]","[€]","[€]","[€]"]
[null,1,{"$f":"Eingabe!$G$65*(1+(Eingabe!G$75/100))^B28","v":159.64347368421053},{"$f":"Eingabe!$M$65*(1+(Eingabe!G$76/100))^B28","v":372.096},{"$f":"D28-C28","v":212.45252631578947},{"$f":"C28/$C$28","v":1},{"$f":"D28/$D$28","v":1}]
[null,2,{"$f":"Eingabe!$G$65*(1+(Eingabe!G$75/100))^B29","v":162.03812578947367},{"$f":"Eingabe!$M$65*(1+(Eingabe!G$76/100))^B29","v":379.53791999999999},{"$f":"D29-C29","v":217.49979421052632},{"$f":"C29/$C$28","v":1.0149999999999999},{"$f":"D29/$D$28","v":1.02}]
[null,3,{"$f":"Eingabe!$G$65*(1+(Eingabe!G$75/100))^B30","v":164.46869767631574},{"$f":"Eingabe!$M$65*(1+(Eingabe!G$76/100))^B30","v":387.12867840000001},222.65998072368427,1.0302249999999997,1.0404]
[null,4,{"$f":"Eingabe!$G$65*(1+(Eingabe!G$75/100))^B31","v":166.93572814146046},{"$f":"Eingabe!$M$65*(1+(Eingabe!G$76/100))^B31","v":394.87125196800002},227.93552382653957,1.0456783749999996,1.0612080000000002]
[null,5,{"$f":"Eingabe!$G$65*(1+(Eingabe!G$75/100))^B32","v":169.43976406358234},{"$f":"Eingabe!$M$65*(1+(Eingabe!G$76/100))^B32","v":402.76867700736},233.32891294377765,1.0613635506249994,1.08243216]
[null,6,{"$f":"Eingabe!$G$65*(1+(Eingabe!G$75/100))^B33","v":171.98136052453603},{"$f":"Eingabe!$M$65*(1+(Eingabe!G$76/100))^B33","v":410.82405054750723},238.8426900229712,1.0772840038843741,1.1040808032]
[null,7,{"$f":"Eingabe!$G$65*(1+(Eingabe!G$75/100))^B34","v":174.56108093240405},{"$f":"Eingabe!$M$65*(1+(Eingabe!G$76/100))^B34","v":419.0405315584573},244.47945062605325,1.0934432639426395,1.1261624192639998]
[null,8,{"$f":"Eingabe!$G$65*(1+(Eingabe!G$75/100))^B35","v":177.1794971463901},{"$f":"Eingabe!$M$65*(1+(Eingabe!G$76/100))^B35","v":427.4213421896265},250.2418450432364,1.1098449129017791,1.14868566764928]
[null,9,{"$f":"Eingabe!$G$65*(1+(Eingabe!G$75/100))^B36","v":179.83718960358593},{"$f":"Eingabe!$M$65*(1+(Eingabe!G$76/100))^B36","v":435.96976903341903},256.13257942983307,1.1264925865953057,1.1716593810022655]
[null,10,{"$f":"Eingabe!$G$65*(1+(Eingabe!G$75/100))^B37","v":182.53474744763969},{"$f":"Eingabe!$M$65*(1+(Eingabe!G$76/100))^B37","v":444.68916441408743},262.15441696644774,1.1433899753942349,1.1950925686223111]
[null,11,{"$f":"Eingabe!$G$65*(1+(Eingabe!G$75/100))^B38","v":185.27276865935428},{"$f":"Eingabe!$M$65*(1+(Eingabe!G$76/100))^B38","v":453.5829477023691},268.31017904301484,1.1605408250251485,1.2189944199947569]
[null,12,{"$f":"Eingabe!$G$65*(1+(Eingabe!G$75/100))^B39","v":188.05186018924454},{"$f":"Eingabe!$M$65*(1+(Eingabe!G$76/100))^B39","v":462.65460665641655},274.60274646717198,1.1779489374005254,1.2433743083946522]
[]
[]
[]
[]
[]
[]
[]
[]
[]
[]
[]
[]
[]
[]
[]
[]
[null,null,null,null,"pes_"]

{"sheet":"Förderungen","index":6,"n_rows":112,"n_cols":20,"rows_kept":112,"cut":false,"hidden":true,"merged":[[53,2,53,3],[53,4,53,5],[53,6,53,7],[67,2,67,3],[67,4,67,5],[67,6,67,7],[103,2,103,3],[103,4,103,5],[103,6,103,7],[79,6,79,7],[57,10,57,15],[91,2,91,3],[91,4,91,5],[91,6,91,7],[79,2,79,3],[79,4,79,5],[71,10,71,15],[45,10,45,15],[29,6,29,7],[107,10,107,15],[83,10,83,15],[95,10,95,15],[74,10,74,15],[14,18,14,27],[41,6,41,7],[38,19,38,22],[4,18,4,27],[5,6,5,7],[33,10,33,15],[35,19,35,21],[5,2,5,3],[5,4,5,5],[21,10,21,15],[41,4,41,5],[41,2,41,3],[17,2,17,3],[17,4,17,5],[17,6,17,7],[29,2,29,3],[29,4,29,5],[9,10,9,15],[31,2,31,3],[32,2,32,3],[33,2,33,3],[34,2,34,3]]}
[]
[]
[null,"Gesamte Förderung:",null,null,null,null,null,null,null,"Landesförderungen:",null,null,null,null,null,null,null,null,"Bundesförderungen:"]
[]
[null,"Förderung für Burgenland",null,null,null,null,null,null,null,"Förderungen aktualisiert am 11.12.2013",null,null,null,null,null,null,null,null,"Klima- und Energiefonds Förderaktion Photovoltaik-Anlagen 2014"]
[null,null,"Anlagengröße",null,"Landesförderung",null,"Bundesförderung"]
[null,null,"","","Investition",null,"Investition","Tarif"]
[null,null,"1 - 3","kWp",300,"€/kWp",{"$f":"IF(H11<>0,200,IF(Eingabe!#REF!=Eingabe!C127,IF(Eingabe!#REF!=Eingabe!C179,275,IF(Eingabe!#REF!=Eingabe!C178,375,0)),0))","v":{"$error":"#REF!"}},"-"]
[null,null,4,"kWp",300,"€/kWp",{"$f":"$G$8","v":{"$error":"#REF!"}},"-",null,null,"Nähere Informationen zur Förderung:"]
[null,null,5,"kWp",300,"€/kWp",{"$f":"$G$8","v":{"$error":"#REF!"}},"-",null,null,"http://www.eabgld.at/index.php?id=986"]
[null,null,"> 5","kWp","-","-",{"$f":"IF(AND($G$8<275,H11<>0),200,0)","v":{"$error":"#REF!"}},{"$f":"IF(AND(Eingabe!#REF!>5,Eingabe!#REF!<=200,Eingabe!#REF!=Eingabe!C125),IF(AND(Eingabe!#REF!=Eingabe!$C$178,Eingabe!#REF!<=20,Eingabe!#REF!=Eingabe!$C$152),Eingabe!$W$186,IF(Eingabe!#REF!=Eingabe!$C$180,Eingabe!$P$195,Eingabe!$I$195)),0)","v":{"$error":"#REF!"}}]
[]
[null,"Information:"]
[null,{"$f":"Eingabe!P165","v":0}]
[]
[]
[null,"Förderung für Kärnten",null,null,null,null,null,null,null,"Förderungen aktualisiert am 11.12.2013"]
[null,null,"Anlagengröße",null,"Landesförderung",null,"Bundesförderung"]
[null,null,"","","Investition",null,"Investition","Tarif"]
[null,null,"1 - 3","kWp","-","-",{"$f":"$G$8","v":{"$error":"#REF!"}},"-"]
[null,null,4,"kWp","-","-",{"$f":"$G$8","v":{"$error":"#REF!"}},"-",null,null,"Nähere Informationen zur Förderung:"]
[null,null,5,"kWp","-","-",{"$f":"$G$8","v":{"$error":"#REF!"}},"-",null,null,"http://www.ktn.gv.at/42109_DE-ktn.gv.at-THEMEN?detail=2&thema=1&subthema="]
[null,null,"> 5","kWp","-","-",{"$f":"$G$11","v":{"$error":"#REF!"}},{"$f":"$H$11","v":{"$error":"#REF!"}}]
[]
[null,"Information:"]
[null,{"$f":"Eingabe!P166","v":0}]
[]
[]
[null,"Förderung für Niederösterreich",null,null,null,null,null,null,null,"Förderungen aktualisiert am 20.01.2015"]
[null,null,"Fahrzeug",null,"Landesförderung",null,"Bundesförderung"]
[null,null,"","","Investition",null,"Investition","Tarif"]
[null,null,"\"reines\" E-Fahrzeug",null,3000,"€",{"$f":"$G$8","v":{"$error":"#REF!"}},"-"]
[null,null,"Plug-In-Hybrid",null,1500,"€",{"$f":"$G$8","v":{"$error":"#REF!"}},"-",null,null,"Nähere Informationen zur Förderung:"]
[null,null,"e-Krafträder inkl. Leichtfahrzeuge",null,"-","-",{"$f":"$G$8","v":{"$error":"#REF!"}},"-",null,null,"http://www.ecoplus.at/de/ecoplus/cluster-niederoesterreich/e-mobil/foerderungen-fuer-e-fahrzeuge"]
[null,null,null,null,"-","-",{"$f":"$G$11","v":{"$error":"#REF!"}},{"$f":"$H$11","v":{"$error":"#REF!"}},null,null,null,null,null,null,null,null,null,null,null,"Zur Registrierung:"]
[null,null,null,null,null,null,null,null,null,null,null,null,null,null,null,null,null,null,null,"https://www.meinefoerderung.at/pv2014/"]
[null,"Information:"]
[null,{"$f":"Eingabe!P167","v":0},null,null,null,null,null,null,null,null,null,null,null,null,null,null,null,null,null,"Zum Leitfaden:"]
[null,null,null,null,null,null,null,null,null,null,null,null,null,null,null,null,null,null,null,"http://www.umweltfoerderung.at/uploads/leitfaden_pv.pdf"]
[]
[null,"Förderung für Oberösterreich",null,null,null,null,null,null,null,"Förderungen aktualisiert am 11.12.2013"]
[null,null,"Anlagengröße",null,"Landesförderung",null,"Bundesförderung"]
[null,null,"","","Investition",null,"Investition","Tarif"]
[null,null,"1 - 3","kWp","-","-",{"$f":"$G$8","v":{"$error":"#REF!"}},"-"]
[null,null,4,"kWp","-","-",{"$f":"$G$8","v":{"$error":"#REF!"}},"-",null,null,"Nähere Informationen zur Förderung:"]
[null,null,5,"kWp","-","-",{"$f":"$G$8","v":{"$error":"#REF!"}},"-",null,null,"http://www.esv.or.at/foerderungen/oekostrom/photovoltaik/"]
[null,null,"> 5","kWp","-","-",{"$f":"$G$11","v":{"$error":"#REF!"}},{"$f":"$H$11","v":{"$error":"#REF!"}}]
[]
[null,"Information:"]
[null,"Keine Förderung durch das Land Oberösterreich"]
[]
[]
[null,"Förderung für Salzburg",null,null,null,null,null,null,null,"Förderungen aktualisiert am 11.12.2013"]
[null,null,"Anlagengröße",null,"Landesförderung",null,"Bundesförderung"]
[null,null,"","","Investition",null,"Investition","Tarif"]
[null,null,"1 - 3","kWp",{"$f":"IF(Eingabe!#REF!<900,\"-\",Eingabe!W195)","v":{"$error":"#REF!"}},"€/kWp",{"$f":"$G$8","v":{"$error":"#REF!"}},"-"]
[null,null,4,"kWp","-","-",{"$f":"$G$8","v":{"$error":"#REF!"}},"-",null,null,"Nähere Informationen zur Förderung:"]
[null,null,5,"kWp","-","-",{"$f":"$G$8","v":{"$error":"#REF!"}},"-",null,null,"http://www.energieaktiv.at/information-und-beratung/foerdermoeglichkeiten/direktzuschuss/solar/fotovoltaik-oekostrom/?utm_source=wes&utm_medium=banner&utm_campaign=weitere+Informationen"]
[null,null,"> 5","kWp","-","-",{"$f":"$G$11","v":{"$error":"#REF!"}},{"$f":"$H$11","v":{"$error":"#REF!"}},null,"Außerdem gibt es folgende Förderung:"]
[null,null,null,null,null,null,null,null,null,"Kombination der PV-Anlage mit einer Wärmepumpe:"]
[null,"Information:",null,null,null,null,null,null,null,"Förderung erfolgt auf Basis eines Punktesystemes;"]
[null,{"$f":"Eingabe!P169","v":0},null,null,null,null,null,null,null,"für die Photovoltaikanlage erhält man maximal 40 Punkte; diese entsprechen 4.000 €"]
[null,null,null,null,null,null,null,null,null,"Die PV-Anlage muss jedoch mindestens 2 kWp groß sein!"]
[]
[null,"Gesamte Förderung:",null,null,null,null,null,null,null,"Landesförderungen:"]
[]
[null,"Förderung für Steiermark",null,null,null,null,null,null,null,"Förderungen aktualisiert am 11.12.2013"]
[null,null,"Anlagengröße",null,"Landesförderung",null,"Bundesförderung"]
[null,null,"","","Investition",null,"Investition","Tarif"]
[null,null,"1 - 3","kWp",{"$f":"IF(OR(Eingabe!$AE$235<2,Eingabe!#REF!<900),\"-\",Eingabe!$AE$236)","v":{"$error":"#REF!"}},{"$f":"IF(E70=\"-\",\"-\",\"€ für \"&Eingabe!$AE$235&\"kWp\")","v":{"$error":"#REF!"}},{"$f":"$G$8","v":{"$error":"#REF!"}},"-"]
[null,null,4,"kWp","-","-",{"$f":"$G$8","v":{"$error":"#REF!"}},"-",null,null,"Nähere Informationen zur Landesförderung:"]
[null,null,5,"kWp","-","-",{"$f":"$G$8","v":{"$error":"#REF!"}},"-",null,null,"http://www.technik.steiermark.at/cms/ziel/59689784/DE/"]
[null,null,"> 5","kWp","-","-",{"$f":"$G$11","v":{"$error":"#REF!"}},{"$f":"$H$11","v":{"$error":"#REF!"}}]
[null,null,null,null,null,null,null,null,null,null,"Nähere Informationen zu den Gemeindeförderungen:"]
[null,"Information:",null,null,null,null,null,null,null,null,"http://www.lev.at/index.asp?S=main/foerderungen/gemausw.asp&S1=left/left.asp"]
[null,{"$f":"Eingabe!P170","v":0}]
[]
[]
[null,"Förderung für Tirol",null,null,null,null,null,null,null,"Förderungen aktualisiert am 11.12.2013"]
[null,null,"Anlagengröße",null,"Landesförderung",null,"Bundesförderung"]
[null,null,"","","Investition",null,"Investition","Tarif"]
[null,null,"1 - 3","kWp","-","€/kWp",{"$f":"$G$8","v":{"$error":"#REF!"}},"-"]
[null,null,4,"kWp","-","€/kWp",{"$f":"$G$8","v":{"$error":"#REF!"}},"-",null,null,"Nähere Informationen zur Förderung:"]
[null,null,5,"kWp","-","€/kWp",{"$f":"$G$8","v":{"$error":"#REF!"}},"-",null,null,"https://www.tirol.gv.at/umwelt/energie/energiefoerderungen/"]
[null,null,"> 5","kWp","-","-",{"$f":"$G$11","v":{"$error":"#REF!"}},{"$f":"$H$11","v":{"$error":"#REF!"}}]
[]
[null,"Information:"]
[null,{"$f":"Eingabe!P171","v":0}]
[]
[]
[null,"Förderung für Vorarlberg",null,null,null,null,null,null,null,"Förderungen aktualisiert am 29.01.2014"]
[null,null,"Anlagengröße",null,"Landesförderung",null,"Bundesförderung"]
[null,null,"","","Investition",null,"Investition","Tarif"]
[null,null,"1 - 3","kWp","-","€/kWp",{"$f":"$G$8","v":{"$error":"#REF!"}},"-"]
[null,null,4,"kWp","-","€/kWp",{"$f":"$G$8","v":{"$error":"#REF!"}},"-",null,null,"Nähere Informationen zur Förderung:"]
[null,null,5,"kWp","-","€/kWp",{"$f":"$G$8","v":{"$error":"#REF!"}},"-",null,null,"http://www.vorarlberg.at/vorarlberg/wasser_energie/energie/energie/foerderungen/sub/foerderungvonphotovoltaik.htm"]
[null,null,"> 5","kWp","-","-",{"$f":"$G$11","v":{"$error":"#REF!"}},{"$f":"$H$11","v":{"$error":"#REF!"}}]
[]
[null,"Information:"]
[null,{"$f":"Eingabe!P172","v":0}]
[]
[]
[null,"Förderung für Wien",null,null,null,null,null,null,null,"Förderungen aktualisiert am 11.12.2013"]
[null,null,"Anlagengröße",null,"Landesförderung",null,"Bundesförderung"]
[null,null,"","","Investition",null,"Investition","Tarif"]
[null,null,"1 - 3","kWp",275,"€/kWp",{"$f":"$G$8","v":{"$error":"#REF!"}},"-"]
[null,null,4,"kWp",275,"€/kWp",{"$f":"$G$8","v":{"$error":"#REF!"}},"-",null,null,"Nähere Informationen zur Förderung:"]
[null,null,5,"kWp",275,"€/kWp",{"$f":"$G$8","v":{"$error":"#REF!"}},"-",null,null,"http://www.umweltfoerderung.at/kpc/de/home/umweltfrderung/fr_private/weitere_frderungen/landesfrderung_wien/"]
[null,null,"> 5","kWp",400,"€/kWp",{"$f":"$G$11","v":{"$error":"#REF!"}},{"$f":"$H$11","v":{"$error":"#REF!"}}]
[]
[null,"Information:"]
[null,{"$f":"Eingabe!P173","v":0}]

{"sheet":"Wetterdaten","index":7,"n_rows":54,"n_cols":13,"rows_kept":54,"cut":false,"hidden":true,"merged":[]}
["Ort","PLZ","Land","PLZ-Differenz","Jährliche Einstrahlung","mittlere Aussentemperatur","Längengrad","Breitengrad","Ermittlung der Einstrahlung"]
[null,null,null,null,"[kWh/m²a]","[°C]","[°]","[°]"]
["Admont",8911,"AUT",{"$f":"IF(B3>$L$3,B3-$L$3,$L$3-B3)","v":{"$error":"#VALUE!"}},1028.32,"    5.86","-14.45"," 47.57",{"$f":"IF($L$4=D3,E3,0)","v":{"$error":"#VALUE!"}},{"$f":"IF(I3=0,0,1)","v":{"$error":"#VALUE!"}},"PLZ:",{"$f":"Eingabe!M12","v":"VW Touran R-Line TDI - Diesel"}]
["Amstetten",3300,"AUT",{"$error":"#VALUE!"},1069.0999999999999,"    8.79","-14.83"," 48.08",{"$error":"#VALUE!"},{"$f":"IF(I4=0,0,1)","v":{"$error":"#VALUE!"}},"Diff:",{"$f":"MIN(D3:D53)","v":{"$error":"#VALUE!"}}]
["Arriach",9543,"AUT",{"$error":"#VALUE!"},1144.54,"    6.46","-13.85"," 46.72",{"$error":"#VALUE!"},{"$error":"#VALUE!"},"Einstrahlung",{"$f":"ROUNDDOWN(K54,-0.5)","v":{"$error":"#VALUE!"}},"kWh/m²a"]
["Bad Gleichenberg",8344,"AUT",{"$error":"#VALUE!"},1153.19,"    9.14","-15.88"," 46.87",{"$error":"#VALUE!"},{"$error":"#VALUE!"}]
["Bad Ischl",4820,"AUT",{"$error":"#VALUE!"},1093.31,"    7.90","-13.60"," 47.72",{"$error":"#VALUE!"},{"$error":"#VALUE!"}]
["Bludenz",6700,"AUT",{"$error":"#VALUE!"},1079.79,"    7.97"," -9.82"," 48.50",{"$error":"#VALUE!"},{"$error":"#VALUE!"}]
["Bruck an der Mur",8600,"AUT",{"$error":"#VALUE!"},1070.77,"    8.07","-15.25"," 47.42",{"$error":"#VALUE!"},{"$error":"#VALUE!"}]
["Eisenerz",8790,"AUT",{"$error":"#VALUE!"},1071.43,"    7.11","-14.88"," 47.53",{"$error":"#VALUE!"},{"$error":"#VALUE!"}]
["Eisenstadt",7000,"AUT",{"$error":"#VALUE!"},1132.17,"   10.01","-16.68"," 47.90",{"$error":"#VALUE!"},{"$error":"#VALUE!"}]
["Feldkirch",6800,"AUT",{"$error":"#VALUE!"},1100.3800000000001,"    8.30"," -9.58"," 47.23",{"$error":"#VALUE!"},{"$error":"#VALUE!"}]
["Ferlach",9170,"AUT",{"$error":"#VALUE!"},1156.25,"    7.82","-14.28"," 46.52",{"$error":"#VALUE!"},{"$error":"#VALUE!"}]
["Fresach ",9712,"AUT",{"$error":"#VALUE!"},1207.3599999999999,"    7.07","-13.68"," 46.70",{"$error":"#VALUE!"},{"$error":"#VALUE!"}]
["Gargellen",6787,"AUT",{"$error":"#VALUE!"},1174.51,"    4.42"," -9.92"," 46.97",{"$error":"#VALUE!"},{"$error":"#VALUE!"}]
["Gmunden",4810,"AUT",{"$error":"#VALUE!"},1088.42,"    8.57","-13.80"," 47.92",{"$error":"#VALUE!"},{"$error":"#VALUE!"}]
["Graz",8010,"AUT",{"$error":"#VALUE!"},1126.02,"    9.17","-15.42"," 47.67",{"$error":"#VALUE!"},{"$error":"#VALUE!"}]
["Gumpoldskirchen",2352,"AUT",{"$error":"#VALUE!"},1125.22,"    9.11","-16.27"," 48.33",{"$error":"#VALUE!"},{"$error":"#VALUE!"}]
["Hallstadt",4830,"AUT",{"$error":"#VALUE!"},1054.8,"    8.00","-13.63"," 47.55",{"$error":"#VALUE!"},{"$error":"#VALUE!"}]
["Imst",6460,"AUT",{"$error":"#VALUE!"},1069.1099999999999,"    7.31","-10.72"," 47.23",{"$error":"#VALUE!"},{"$error":"#VALUE!"}]
["Innsbruck",6020,"AUT",{"$error":"#VALUE!"},1089.72,"    8.61","-11.40"," 47.27",{"$error":"#VALUE!"},{"$error":"#VALUE!"}]
["Kitzbuehl",6370,"AUT",{"$error":"#VALUE!"},1069.8800000000001,"    6.19","-12.38"," 47.45",{"$error":"#VALUE!"},{"$error":"#VALUE!"}]
["Klagenfurt",9010,"AUT",{"$error":"#VALUE!"},1131,"    8.14","-14.30"," 46.62",{"$error":"#VALUE!"},{"$error":"#VALUE!"}]
["Krems a. d. Donau",3500,"AUT",{"$error":"#VALUE!"},1071.4000000000001,"    9.62","-15.58"," 48.50",{"$error":"#VALUE!"},{"$error":"#VALUE!"}]
["Kremsmünster",4550,"AUT",{"$error":"#VALUE!"},1046.5,"    7.69","-14.12"," 48.05",{"$error":"#VALUE!"},{"$error":"#VALUE!"}]
["Leoben",8700,"AUT",{"$error":"#VALUE!"},1068.49,"    8.30","-15.83"," 47.37",{"$error":"#VALUE!"},{"$error":"#VALUE!"}]
["Lienz",9900,"AUT",{"$error":"#VALUE!"},1147.74,"    7.41","-12.80"," 46.83",{"$error":"#VALUE!"},{"$error":"#VALUE!"}]
["Lilienfeld",3180,"AUT",{"$error":"#VALUE!"},1075.26,"    8.36","-15.62"," 48.17",{"$error":"#VALUE!"},{"$error":"#VALUE!"}]
["Millstatt",9872,"AUT",{"$error":"#VALUE!"},1189.53,"    8.67","-13.57"," 46.80",{"$error":"#VALUE!"},{"$error":"#VALUE!"}]
["Mondsee",5310,"AUT",{"$error":"#VALUE!"},1046.56,"    7.84","-13.33"," 47.85",{"$error":"#VALUE!"},{"$error":"#VALUE!"}]
["Mönichkirchen",2872,"AUT",{"$error":"#VALUE!"},1083.3,"    6.25","-16.17"," 47.50",{"$error":"#VALUE!"},{"$error":"#VALUE!"}]
["Nauders",6543,"AUT",{"$error":"#VALUE!"},1201.4100000000001,"    4.71","-10.50"," 46.88",{"$error":"#VALUE!"},{"$error":"#VALUE!"}]
["Neumarkt in der Steiermark",8820,"AUT",{"$error":"#VALUE!"},1161.95,"    6.39","-14.42"," 47.67",{"$error":"#VALUE!"},{"$error":"#VALUE!"}]
["Obervellach",9821,"AUT",{"$error":"#VALUE!"},1226.7,"    8.44","-13.20"," 46.93",{"$error":"#VALUE!"},{"$error":"#VALUE!"}]
["Oberwölz Stadt",8832,"AUT",{"$f":"IF(B35>$L$3,B35-$L$3,$L$3-B35)","v":{"$error":"#VALUE!"}},1107.8499999999999,"    6.20","-14.27"," 47.20",{"$f":"IF($L$4=D35,E35,0)","v":{"$error":"#VALUE!"}},{"$error":"#VALUE!"}]
["Radentheim",9545,"AUT",{"$error":"#VALUE!"},1133.1199999999999,"    7.53","-13.70"," 46.80",{"$error":"#VALUE!"},{"$error":"#VALUE!"}]
["Ramsau Dachstein",8972,"AUT",{"$error":"#VALUE!"},1129.03,"    5.16","-12.88"," 47.60",{"$error":"#VALUE!"},{"$error":"#VALUE!"}]
["Rauris",5661,"AUT",{"$error":"#VALUE!"},1124.1500000000001,"    5.82","-12.98"," 47.23",{"$error":"#VALUE!"},{"$error":"#VALUE!"}]
["Reichersberg",4981,"AUT",{"$error":"#VALUE!"},1037.3699999999999,"    8.48","-13.37"," 48.33",{"$error":"#VALUE!"},{"$error":"#VALUE!"}]
["Reichraming",4462,"AUT",{"$error":"#VALUE!"},1068.82,"    8.13","-14.45"," 47.88",{"$error":"#VALUE!"},{"$error":"#VALUE!"}]
["Salzburg",5020,"AUT",{"$error":"#VALUE!"},1113.6099999999999,"    8.39","-13.33"," 47.82",{"$error":"#VALUE!"},{"$error":"#VALUE!"}]
["St. Lorenzen im Lesachtal",9654,"AUT",{"$error":"#VALUE!"},1217.1300000000001,"    5.73"," 12.77"," 46.70",{"$error":"#VALUE!"},{"$error":"#VALUE!"}]
["St. Michael i. Lundgau",5582,"AUT",{"$error":"#VALUE!"},1194.76,"    6.55","-13.48"," 47.83",{"$error":"#VALUE!"},{"$error":"#VALUE!"}]
["St. Pölten",3100,"AUT",{"$error":"#VALUE!"},1031.18,"    8.59","-15.60"," 48.20",{"$error":"#VALUE!"},{"$error":"#VALUE!"}]
["Velden am Wörtersee",9220,"AUT",{"$error":"#VALUE!"},1189.4000000000001,"    8.04","-14.33"," 46.62",{"$error":"#VALUE!"},{"$error":"#VALUE!"}]
["Villach",9500,"AUT",{"$error":"#VALUE!"},1188.95,"    8.04","-13.83"," 46.62",{"$error":"#VALUE!"},{"$error":"#VALUE!"}]
["Wels",4600,"AUT",{"$error":"#VALUE!"},1036.5,"    8.67","-14.17"," 48.17",{"$error":"#VALUE!"},{"$error":"#VALUE!"}]
["Weyer Mark",3335,"AUT",{"$error":"#VALUE!"},1106.53,"    7.58","-14.65"," 47.85",{"$error":"#VALUE!"},{"$error":"#VALUE!"}]
["Wien",1190,"AUT",{"$error":"#VALUE!"},1084.48,"    9.77","-16.33"," 48.20",{"$error":"#VALUE!"},{"$error":"#VALUE!"}]
["Wiener Neustadt",2700,"AUT",{"$error":"#VALUE!"},1080.56,"    9.44","-16.23"," 47.82",{"$error":"#VALUE!"},{"$error":"#VALUE!"}]
["Wolfsberg",9400,"AUT",{"$error":"#VALUE!"},1066.68,"    7.86","-14.83"," 46.85",{"$error":"#VALUE!"},{"$error":"#VALUE!"}]
["Zell am See",5700,"AUT",{"$error":"#VALUE!"},1080.32,"    6.55","-12.77"," 47.32",{"$error":"#VALUE!"},{"$error":"#VALUE!"}]
["Zwettl",3910,"AUT",{"$error":"#VALUE!"},1051.52,"    5.71","-15.15"," 48.58",{"$error":"#VALUE!"},{"$error":"#VALUE!"}]
[null,null,null,null,null,null,null,"Einstrahlungswert:",{"$f":"SUM(I3:I53)","v":{"$error":"#VALUE!"}},{"$f":"SUM(J3:J53)","v":{"$error":"#VALUE!"}},{"$f":"I54/J54","v":{"$error":"#VALUE!"}}]

{"sheet":"PLZ-Zuordnung","index":8,"n_rows":2460,"n_cols":10,"rows_kept":2460,"cut":false,"hidden":true,"merged":[]}
["PLZ","Ort","Bundesland","NamePLZTyp","intern_extern","adressierbar","Postfach"]
[null,null,null,null,null,null,null,null,"Zuordnung der PLZ und des Ortes (Bundesland):"]
[1004,"Wien","W","InteressentenPLZ","extern","Nein","Ja",null,{"$f":"Eingabe!M12","v":"VW Touran R-Line TDI - Diesel"},{"$f":"VLOOKUP(I3,A3:C2460,3,TRUE)","v":{"$error":"#N/A"}}]
[1010,"Wien","W","PLZ-Adressierung","extern","Ja","Ja",null,null,{"$f":"VLOOKUP(J3,I7:J15,2,TRUE)","v":{"$error":"#N/A"}}]
[1011,"Wien Postfach","W","PLZ-Postfach","extern","Nein","Ja",null,null,{"$f":"VLOOKUP(I3,A3:C2460,2,FALSE)","v":{"$error":"#N/A"}}]
[1012,"Wien","W","PLZ-Postfach","extern","Nein","Ja"]
[1013,"Wien","W","PLZ-Postfach","extern","Nein","Ja",null,"B","Burgenland"]
[1014,"Wien","W","PLZ-Postfach","extern","Nein","Ja",null,"K","Kärnten"]
[1015,"Wien","W","PLZ-Postfach","extern","Nein","Ja",null,"N","Niederösterreich"]
[1016,"Wien","W","PLZ-Postfach","extern","Nein","Ja",null,"O","Oberösterreich"]
[1017,"Wien-Parlament","W","PLZ-Postfach","extern","Nein","Ja",null,"Sa","Salzburg"]
[1018,"Wien","W","PLZ-Postfach","extern","Nein","Ja",null,"St","Steiermark"]
[1020,"Wien","W","PLZ-Adressierung","extern","Ja","Ja",null,"T","Tirol"]
[1021,"Wien Postfach","W","PLZ-Postfach","extern","Nein","Ja",null,"V","Vorarlberg"]
[1022,"Wien","W","PLZ-Postfach","extern","Nein","Ja",null,"W","Wien"]
[1023,"Wien","W","PLZ-Postfach","extern","Nein","Ja"]
[1024,"Wien","W","PLZ-Postfach","extern","Nein","Ja"]
[1025,"Wien","W","PLZ-Postfach","extern","Nein","Ja"]
[1029,"Wien","W","InteressentenPLZ","extern","Nein","Ja"]
[1030,"Wien","W","PLZ-Adressierung","extern","Ja","Ja"]
[1031,"Wien Postfach","W","PLZ-Postfach","extern","Nein","Ja"]
[1033,"Wien","W","PLZ-Postfach","extern","Nein","Ja"]
[1034,"Wien","W","PLZ-Postfach","extern","Nein","Ja"]
[1035,"Wien","W","PLZ-Postfach","extern","Nein","Ja"]
[1036,"Wien","W","PLZ-Postfach","extern","Nein","Ja"]
[1037,"Wien","W","PLZ-Postfach","extern","Nein","Ja"]
[1038,"Wien","W","InteressentenPLZ","extern","Nein","Ja"]
[1039,"Wien","W","InteressentenPLZ","extern","Nein","Ja"]
[1040,"Wien","W","PLZ-Adressierung","extern","Ja","Ja"]
[1041,"Wien Postfach","W","PLZ-Postfach","extern","Nein","Ja"]
[1042,"Wien","W","PLZ-Postfach","extern","Nein","Ja"]
[1043,"Wien","W","PLZ-Postfach","extern","Nein","Ja"]
[1045,"Wien","W","InteressentenPLZ","extern","Nein","Ja"]
[1050,"Wien","W","PLZ-Adressierung","extern","Ja","Ja"]
[1051,"Wien Postfach","W","PLZ-Postfach","extern","Nein","Ja"]
[1052,"Wien","W","PLZ-Postfach","extern","Nein","Ja"]
[1053,"Wien","W","PLZ-Postfach","extern","Nein","Ja"]
[1060,"Wien","W","PLZ-Adressierung","extern","Ja","Ja"]
[1061,"Wien Postfach","W","PLZ-Postfach","extern","Nein","Ja"]
[1062,"Wien","W","PLZ-Postfach","extern","Nein","Ja"]
[1063,"Wien-VÖPh","W","InteressentenPLZ","extern","Nein","Ja"]
[1070,"Wien","W","PLZ-Adressierung","extern","Ja","Ja"]
[1071,"Wien Postfach","W","PLZ-Postfach","extern","Nein","Ja"]
[1072,"Wien","W","PLZ-Postfach","extern","Nein","Ja"]
[1080,"Wien","W","PLZ-Adressierung","extern","Ja","Ja"]
[1081,"Wien Postfach","W","PLZ-Postfach","extern","Nein","Ja"]
[1082,"Wien","W","PLZ-Postfach","extern","Nein","Ja"]
[1090,"Wien","W","PLZ-Adressierung","extern","Ja","Ja"]
[1091,"Wien Postfach","W","PLZ-Postfach","extern","Nein","Ja"]
[1092,"Wien","W","PLZ-Postfach","extern","Nein","Ja"]
[1093,"Wien","W","PLZ-Postfach","extern","Nein","Ja"]
[1094,"Wien","W","PLZ-Postfach","extern","Nein","Ja"]
[1095,"Wien","W","PLZ-Postfach","extern","Nein","Ja"]
[1096,"Wien","W","PLZ-Postfach","extern","Nein","Ja"]
[1097,"Wien","W","PLZ-Postfach","extern","Nein","Ja"]
[1100,"Wien","W","PLZ-Adressierung","extern","Ja","Ja"]
[1101,"Wien Postfach","W","PLZ-Postfach","extern","Nein","Ja"]
[1102,"Wien","W","PLZ-Postfach","extern","Nein","Ja"]
[1103,"Wien","W","PLZ-Postfach","extern","Nein","Ja"]
[1104,"Wien","W","PLZ-Postfach","extern","Nein","Ja"]
[1105,"Wien","W","PLZ-Postfach","extern","Nein","Ja"]
[1106,"Wien","W","PLZ-Postfach","extern","Nein","Ja"]
[1107,"Wien","W","PLZ-Postfach","extern","Nein","Ja"]
[1108,"Wien","W","PLZ-Postfach","extern","Nein","Ja"]
[1109,"Wien","W","PLZ-Postfach","extern","Nein","Ja"]
[1110,"Wien","W","PLZ-Adressierung","extern","Ja","Ja"]
[1111,"Wien Postfach","W","PLZ-Postfach","extern","Nein","Ja"]
[1112,"Wien","W","PLZ-Postfach","extern","Nein","Ja"]
[1113,"Wien","W","PLZ-Postfach","extern","Nein","Ja"]
[1120,"Wien","W","PLZ-Adressierung","extern","Ja","Ja"]
[1121,"Wien Postfach","W","PLZ-Postfach","extern","Nein","Ja"]
[1122,"Wien","W","PLZ-Postfach","extern","Nein","Ja"]
[1125,"Wien","W","PLZ-Postfach","extern","Nein","Ja"]
[1126,"Wien","W","PLZ-Postfach","extern","Nein","Ja"]
[1127,"Wien","W","PLZ-Postfach","extern","Nein","Ja"]
[1130,"Wien","W","PLZ-Adressierung","extern","Ja","Ja"]
[1131,"Wien Postfach","W","PLZ-Postfach","extern","Nein","Ja"]
[1132,"Wien","W","PLZ-Postfach","extern","Nein","Ja"]
[1133,"Wien","W","PLZ-Postfach","extern","Nein","Ja"]
[1134,"Wien","W","PLZ-Postfach","extern","Nein","Ja"]
[1136,"Wien","W","InteressentenPLZ","extern","Nein","Ja"]
[1140,"Wien","W","PLZ-Adressierung","extern","Ja","Ja"]
[1141,"Wien Postfach","W","PLZ-Postfach","extern","Nein","Ja"]
[1142,"Wien","W","PLZ-Postfach","extern","Nein","Ja"]
[1143,"Wien","W","PLZ-Postfach","extern","Nein","Ja"]
[1144,"Wien","W","PLZ-Postfach","extern","Nein","Ja"]
[1145,"Wien","W","PLZ-Postfach","extern","Nein","Ja"]
[1147,"Wien","W","PLZ-Postfach","extern","Nein","Ja"]
[1148,"Wien","W","InteressentenPLZ","extern","Nein","Ja"]
[1150,"Wien","W","PLZ-Adressierung","extern","Ja","Ja"]
[1151,"Wien Postfach","W","PLZ-Postfach","extern","Nein","Ja"]
[1152,"Wien","W","PLZ-Postfach","extern","Nein","Ja"]
[1153,"Wien","W","PLZ-Postfach","extern","Nein","Ja"]
[1160,"Wien","W","PLZ-Adressierung","extern","Ja","Ja"]
[1161,"Wien Postfach","W","PLZ-Postfach","extern","Nein","Ja"]
[1163,"Wien","W","PLZ-Postfach","extern","Nein","Ja"]
[1165,"Wien","W","PLZ-Postfach","extern","Nein","Ja"]
[1166,"Wien","W","PLZ-Postfach","extern","Nein","Ja"]
[1170,"Wien","W","PLZ-Adressierung","extern","Ja","Ja"]
[1171,"Wien Postfach","W","PLZ-Postfach","extern","Nein","Ja"]
[1172,"Wien","W","PLZ-Postfach","extern","Nein","Ja"]
[1173,"Wien","W","PLZ-Postfach","extern","Nein","Ja"]
[1180,"Wien","W","PLZ-Adressierung","extern","Ja","Ja"]
[1181,"Wien Postfach","W","PLZ-Postfach","extern","Nein","Ja"]
[1182,"Wien","W","PLZ-Postfach","extern","Nein","Ja"]
[1183,"Wien","W","PLZ-Postfach","extern","Nein","Ja"]
[1190,"Wien","W","PLZ-Adressierung","extern","Ja","Ja"]
[1191,"Wien Postfach","W","PLZ-Postfach","extern","Nein","Ja"]
[1192,"Wien","W","PLZ-Postfach","extern","Nein","Ja"]
[1193,"Wien","W","PLZ-Postfach","extern","Nein","Ja"]
[1194,"Wien","W","PLZ-Postfach","extern","Nein","Ja"]
[1195,"Wien","W","PLZ-Postfach","extern","Nein","Ja"]
[1196,"Wien","W","PLZ-Postfach","extern","Nein","Ja"]
[1200,"Wien","W","PLZ-Adressierung","extern","Ja","Ja"]
[1201,"Wien Postfach","W","PLZ-Postfach","extern","Nein","Ja"]
[1202,"Wien","W","PLZ-Postfach","extern","Nein","Ja"]
[1203,"Wien","W","PLZ-Postfach","extern","Nein","Ja"]
[1204,"Wien","W","PLZ-Postfach","extern","Nein","Ja"]
[1205,"Wien","W","PLZ-Postfach","extern","Nein","Ja"]
[1206,"Wien","W","PLZ-Postfach","extern","Nein","Ja"]
[1210,"Wien","W","PLZ-Adressierung","extern","Ja","Ja"]
[1211,"Wien Postfach","W","PLZ-Postfach","extern","Nein","Ja"]
[1212,"Wien","W","PLZ-Postfach","extern","Nein","Ja"]
[1213,"Wien","W","PLZ-Postfach","extern","Nein","Ja"]
[1214,"Wien","W","PLZ-Postfach","extern","Nein","Ja"]
[1215,"Wien","W","PLZ-Postfach","extern","Nein","Ja"]
[1216,"Wien","W","PLZ-Postfach","extern","Nein","Ja"]
[1217,"Wien","W","PLZ-Postfach","extern","Nein","Ja"]
[1218,"Wien","W","PLZ-Postfach","extern","Nein","Ja"]
[1220,"Wien","W","PLZ-Adressierung","extern","Ja","Ja"]
[1221,"Wien Postfach","W","PLZ-Postfach","extern","Nein","Ja"]
[1222,"Wien","W","PLZ-Postfach","extern","Nein","Ja"]
[1223,"Wien","W","PLZ-Postfach","extern","Nein","Ja"]
[1224,"Wien","W","PLZ-Postfach","extern","Nein","Ja"]
[1225,"Wien","W","PLZ-Postfach","extern","Nein","Ja"]
[1226,"Wien","W","PLZ-Postfach","extern","Nein","Ja"]
[1228,"Wien","W","PLZ-Postfach","extern","Nein","Ja"]
[1229,"Wien","W","PLZ-Postfach","extern","Nein","Ja"]
[1230,"Wien","W","PLZ-Adressierung","extern","Ja","Ja"]
[1231,"Wien Postfach","W","PLZ-Postfach","extern","Nein","Ja"]
[1232,"Wien","W","PLZ-Postfach","extern","Nein","Ja"]
[1233,"Wien","W","PLZ-Postfach","extern","Nein","Ja"]
[1234,"Wien","W","PLZ-Postfach","extern","Nein","Ja"]
[1235,"Wien","W","PLZ-Postfach","extern","Nein","Ja"]
[1236,"Wien","W","PLZ-Postfach","extern","Nein","Ja"]
[1238,"Wien","W","PLZ-Postfach","extern","Nein","Ja"]
[1239,"Wien","W","PLZ-Postfach","extern","Nein","Ja"]
[1300,"Wien-Flughafen","W","PLZ-Adressierung","extern","Ja","Ja"]
[1400,"Wien-Vereinte Nationen","W","PLZ-Postfach","extern","Nein","Ja"]
[1402,"Wien","W","PLZ-Postfach","extern","Nein","Ja"]
[1423,"Wien","W","PLZ-Postfach","extern","Nein","Ja"]
[1500,"UNDOF AUSBATT","W","FeldPLZ","extern","Nein","Ja"]
[1502,"AUCON EUFOR","W","FeldPLZ","extern","Nein","Ja"]
[1503,"AUCON KFOR","W","FeldPLZ","extern","Nein","Ja"]
[1600,"Wien","W","InteressentenPLZ","extern","Nein","Ja"]
[2000,"Stockerau","N","PLZ-Adressierung","extern","Ja","Ja"]
[2002,"Großmugl","N","PLZ-Adressierung","extern","Ja","Nein"]
[2003,"Leitzersdorf","N","PLZ-Adressierung","extern","Ja","Nein"]
[2004,"Niederhollabrunn","N","PLZ-Adressierung","extern","Ja","Nein"]
[2011,"Sierndorf","N","PLZ-Adressierung","extern","Ja","Nein"]
[2013,"Göllersdorf","N","PLZ-Adressierung","extern","Ja","Nein"]
[2014,"Breitenwaida","N","PLZ-Adressierung","extern","Ja","Nein"]
[2020,"Hollabrunn","N","PLZ-Adressierung","extern","Ja","Ja"]
[2022,"Immendorf","N","PLZ-Adressierung","extern","Ja","Nein"]
[2023,"Nappersdorf","N","PLZ-Adressierung","extern","Ja","Ja"]
[2024,"Mailberg","N","PLZ-Adressierung","extern","Ja","Nein"]
[2031,"Eggendorf im Thale","N","PLZ-Adressierung","extern","Ja","Nein"]
[2032,"Enzersdorf im Thale","N","PLZ-Adressierung","extern","Ja","Nein"]
[2033,"Kammersdorf","N","PLZ-Adressierung","extern","Ja","Nein"]
[2034,"Großharras","N","PLZ-Adressierung","extern","Ja","Ja"]
[2041,"Wullersdorf","N","PLZ-Adressierung","extern","Ja","Ja"]
[2042,"Guntersdorf","N","PLZ-Adressierung","extern","Ja","Nein"]
[2051,"Zellerndorf","N","PLZ-Adressierung","extern","Ja","Ja"]
[2052,"Pernersdorf-Pfaffendorf","N","PLZ-Adressierung","extern","Ja","Nein"]
[2053,"Jetzelsdorf","N","PLZ-Adressierung","extern","Ja","Nein"]
[2054,"Haugsdorf","N","PLZ-Adressierung","extern","Ja","Ja"]
[2061,"Hadres","N","PLZ-Adressierung","extern","Ja","Ja"]
[2062,"Seefeld-Großkadolz","N","PLZ-Adressierung","extern","Ja","Nein"]
[2063,"Zwingendorf","N","PLZ-Adressierung","extern","Ja","Nein"]
[2064,"Wulzeshofen","N","PLZ-Adressierung","extern","Ja","Nein"]
[2070,"Retz","N","PLZ-Adressierung","extern","Ja","Ja"]
[2073,"Schrattenthal","N","PLZ-Adressierung","extern","Ja","Nein"]
[2074,"Unterretzbach","N","PLZ-Adressierung","extern","Ja","Nein"]
[2081,"Niederfladnitz","N","PLZ-Adressierung","extern","Ja","Nein"]
[2082,"Hardegg","N","PLZ-Adressierung","extern","Ja","Nein"]
[2083,"Pleißing","N","PLZ-Adressierung","extern","Ja","Nein"]
[2084,"Weitersfeld","N","PLZ-Adressierung","extern","Ja","Ja"]
[2091,"Langau","N","PLZ-Adressierung","extern","Ja","Nein"]
[2092,"Riegersburg","N","PLZ-Adressierung","extern","Ja","Nein"]
[2093,"Geras","N","PLZ-Adressierung","extern","Ja","Ja"]
[2094,"Zissersdorf","N","PLZ-Adressierung","extern","Ja","Nein"]
[2095,"Drosendorf","N","PLZ-Adressierung","extern","Ja","Nein"]
[2100,"Korneuburg","N","PLZ-Adressierung","extern","Ja","Ja"]
[2102,"Bisamberg","N","PLZ-Adressierung","extern","Ja","Ja"]
[2103,"Langenzersdorf","N","PLZ-Adressierung","extern","Ja","Ja"]
[2104,"Spillern","N","PLZ-Adressierung","extern","Ja","Ja"]
[2105,"Oberrohrbach","N","PLZ-Adressierung","extern","Ja","Nein"]
[2111,"Rückersdorf-Harmannsdorf","N","PLZ-Adressierung","extern","Ja","Nein"]
[2112,"Würnitz","N","PLZ-Adressierung","extern","Ja","Nein"]
[2113,"Karnabrunn","N","PLZ-Adressierung","extern","Ja","Nein"]
[2114,"Großrußbach","N","PLZ-Adressierung","extern","Ja","Nein"]
[2115,"Ernstbrunn","N","PLZ-Adressierung","extern","Ja","Ja"]
[2116,"Niederleis","N","PLZ-Adressierung","extern","Ja","Nein"]
[2120,"Wolkersdorf im Weinviertel","N","PLZ-Adressierung","extern","Ja","Ja"]
[2122,"Ulrichskirchen","N","PLZ-Adressierung","extern","Ja","Ja"]
[2123,"Schleinbach","N","PLZ-Adressierung","extern","Ja","Nein"]
[2124,"Niederkreuzstetten","N","PLZ-Adressierung","extern","Ja","Ja"]
[2125,"Neubau","N","PLZ-Adressierung","extern","Ja","Nein"]
[2126,"Ladendorf","N","PLZ-Adressierung","extern","Ja","Nein"]
[2130,"Mistelbach","N","PLZ-Adressierung","extern","Ja","Ja"]
[2132,"Frättingsdorf","N","PLZ-Adressierung","extern","Ja","Nein"]
[2133,"Loosdorf","N","PLZ-Adressierung","extern","Ja","Nein"]
[2134,"Staatz-Kautendorf","N","PLZ-Adressierung","extern","Ja","Nein"]
[2135,"Neudorf bei Staatz","N","PLZ-Adressierung","extern","Ja","Nein"]
[2136,"Laa an der Thaya","N","PLZ-Adressierung","extern","Ja","Ja"]
[2141,"Ameis","N","PLZ-Adressierung","extern","Ja","Ja"]
[2143,"Großkrut","N","PLZ-Adressierung","extern","Ja","Nein"]
[2144,"Altlichtenwarth","N","PLZ-Adressierung","extern","Ja","Nein"]
[2145,"Hausbrunn","N","PLZ-Adressierung","extern","Ja","Ja"]
[2151,"Asparn an der Zaya","N","PLZ-Adressierung","extern","Ja","Nein"]
[2152,"Gnadendorf","N","PLZ-Adressierung","extern","Ja","Ja"]
[2153,"Stronsdorf","N","PLZ-Adressierung","extern","Ja","Nein"]
[2154,"Unterstinkenbrunn","N","PLZ-Adressierung","extern","Ja","Nein"]
[2161,"Poysbrunn","N","PLZ-Adressierung","extern","Ja","Ja"]
[2162,"Falkenstein","N","PLZ-Adressierung","extern","Ja","Nein"]
[2163,"Ottenthal","N","PLZ-Adressierung","extern","Ja","Ja"]
[2164,"Wildendürnbach","N","PLZ-Adressierung","extern","Ja","Nein"]
[2165,"Drasenhofen","N","PLZ-Adressierung","extern","Ja","Nein"]
[2170,"Poysdorf","N","PLZ-Adressierung","extern","Ja","Ja"]
[2171,"Herrnbaumgarten","N","PLZ-Adressierung","extern","Ja","Nein"]
[2172,"Schrattenberg","N","PLZ-Adressierung","extern","Ja","Ja"]
[2181,"Dobermannsdorf","N","PLZ-Adressierung","extern","Ja","Nein"]
[2182,"Palterndorf","N","PLZ-Adressierung","extern","Ja","Nein"]
[2183,"Neusiedl an der Zaya","N","PLZ-Adressierung","extern","Ja","Nein"]
[2184,"Hauskirchen","N","PLZ-Adressierung","extern","Ja","Nein"]
[2185,"Prinzendorf an der Zaya","N","PLZ-Adressierung","extern","Ja","Nein"]
[2191,"Gaweinstal","N","PLZ-Adressierung","extern","Ja","Ja"]
[2192,"Kettlasbrunn","N","PLZ-Adressierung","extern","Ja","Nein"]
[2193,"Wilfersdorf","N","PLZ-Adressierung","extern","Ja","Nein"]
[2201,"Gerasdorf","N","PLZ-Adressierung","extern","Ja","Ja"]
[2202,"Enzersfeld","N","PLZ-Adressierung","extern","Ja","Ja"]
[2203,"Großebersdorf","N","PLZ-Adressierung","extern","Ja","Ja"]
[2211,"Pillichsdorf","N","PLZ-Adressierung","extern","Ja","Nein"]
[2212,"Großengersdorf","N","PLZ-Adressierung","extern","Ja","Nein"]
[2213,"Bockfließ","N","PLZ-Adressierung","extern","Ja","Ja"]
[2214,"Auersthal","N","PLZ-Adressierung","extern","Ja","Ja"]
[2215,"Raggendorf","N","PLZ-Adressierung","extern","Ja","Nein"]
[2221,"Groß Schweinbarth","N","PLZ-Adressierung","extern","Ja","Nein"]
[2222,"Bad Pirawarth","N","PLZ-Adressierung","extern","Ja","Nein"]
[2223,"Hohenruppersdorf","N","PLZ-Adressierung","extern","Ja","Nein"]
[2224,"Obersulz","N","PLZ-Adressierung","extern","Ja","Nein"]
[2225,"Zistersdorf","N","PLZ-Adressierung","extern","Ja","Ja"]
[2230,"Gänserndorf","N","PLZ-Adressierung","extern","Ja","Ja"]
[2231,"Strasshof an der Nordbahn","N","PLZ-Adressierung","extern","Ja","Ja"]
[2232,"Deutsch Wagram","N","PLZ-Adressierung","extern","Ja","Ja"]
[2241,"Schönkirchen","N","PLZ-Adressierung","extern","Ja","Nein"]
[2242,"Prottes","N","PLZ-Adressierung","extern","Ja","Ja"]
[2243,"Matzen","N","PLZ-Adressierung","extern","Ja","Nein"]
[2244,"Spannberg","N","PLZ-Adressierung","extern","Ja","Nein"]
[2245,"Velm-Götzendorf","N","PLZ-Adressierung","extern","Ja","Nein"]
[2251,"Ebenthal","N","PLZ-Adressierung","extern","Ja","Nein"]
[2252,"Ollersdorf","N","PLZ-Adressierung","extern","Ja","Nein"]
[2253,"Weikendorf","N","PLZ-Adressierung","extern","Ja","Nein"]
[2261,"Angern an der March","N","PLZ-Adressierung","extern","Ja","Ja"]
[2262,"Stillfried","N","PLZ-Adressierung","extern","Ja","Nein"]
[2263,"Dürnkrut","N","PLZ-Adressierung","extern","Ja","Ja"]
[2264,"Jedenspeigen","N","PLZ-Adressierung","extern","Ja","Nein"]
[2265,"Drösing","N","PLZ-Adressierung","extern","Ja","Nein"]
[2272,"Niederabsdorf","N","PLZ-Adressierung","extern","Ja","Nein"]
[2273,"Hohenau an der March","N","PLZ-Adressierung","extern","Ja","Ja"]
[2274,"Rabensburg","N","PLZ-Adressierung","extern","Ja","Ja"]
[2275,"Bernhardsthal","N","PLZ-Adressierung","extern","Ja","Nein"]
[2276,"Reintal","N","PLZ-Adressierung","extern","Ja","Nein"]
[2281,"Raasdorf","N","PLZ-Adressierung","extern","Ja","Nein"]
[2282,"Markgrafneusiedl","N","PLZ-Adressierung","extern","Ja","Nein"]
[2283,"Obersiebenbrunn","N","PLZ-Adressierung","extern","Ja","Ja"]
[2284,"Untersiebenbrunn","N","PLZ-Adressierung","extern","Ja","Nein"]
[2285,"Leopoldsdorf im Marchfelde","N","PLZ-Adressierung","extern","Ja","Nein"]
[2286,"Haringsee","N","PLZ-Adressierung","extern","Ja","Nein"]
[2291,"Lassee","N","PLZ-Adressierung","extern","Ja","Ja"]
[2292,"Engelhartstetten","N","PLZ-Adressierung","extern","Ja","Nein"]
[2293,"Marchegg Stadt","N","PLZ-Adressierung","extern","Ja","Nein"]
[2294,"Marchegg Bahnhof","N","PLZ-Adressierung","extern","Ja","Ja"]
[2295,"Oberweiden","N","PLZ-Adressierung","extern","Ja","Nein"]
[2301,"Groß-Enzersdorf","N","PLZ-Adressierung","extern","Ja","Ja"]
[2304,"Orth an der Donau","N","PLZ-Adressierung","extern","Ja","Ja"]
[2305,"Eckartsau","N","PLZ-Adressierung","extern","Ja","Nein"]
[2320,"Schwechat","N","PLZ-Adressierung","extern","Ja","Ja"]
[2322,"Zwölfaxing","N","PLZ-Adressierung","extern","Ja","Nein"]
[2323,"Schwechat-Mannswörth","N","PLZ-Postfach","extern","Nein","Ja"]
[2324,"Schwechat-Rannersdorf","N","PLZ-Postfach","extern","Nein","Ja"]
[2325,"Himberg","N","PLZ-Adressierung","extern","Ja","Ja"]
[2326,"Maria Lanzendorf","N","PLZ-Adressierung","extern","Ja","Ja"]
[2331,"Vösendorf","N","PLZ-Adressierung","extern","Ja","Ja"]
[2332,"Hennersdorf","N","PLZ-Adressierung","extern","Ja","Ja"]
[2333,"Leopoldsdorf","N","PLZ-Adressierung","extern","Ja","Ja"]
[2334,"Vösendorf","N","PLZ-Adressierung","extern","Ja","Ja"]
[2340,"Mödling","N","PLZ-Adressierung","extern","Ja","Ja"]
[2342,"Mödling","N","PLZ-Postfach","extern","Nein","Ja"]
[2344,"Maria Enzersdorf","N","PLZ-Adressierung","extern","Ja","Ja"]
[2345,"Brunn am Gebirge","N","PLZ-Adressierung","extern","Ja","Ja"]
[2346,"Maria Enzersdorf-Südstadt","N","PLZ-Postfach","extern","Nein","Ja"]
[2351,"Wiener Neudorf","N","PLZ-Adressierung","extern","Ja","Ja"]
[2352,"Gumpoldskirchen","N","PLZ-Adressierung","extern","Ja","Ja"]
[2353,"Guntramsdorf","N","PLZ-Adressierung","extern","Ja","Ja"]
[2355,"Wiener Neudorf","N","PLZ-Postfach","extern","Nein","Ja"]
[2361,"Laxenburg","N","PLZ-Adressierung","extern","Ja","Ja"]
[2362,"Biedermannsdorf","N","PLZ-Adressierung","extern","Ja","Ja"]
[2371,"Hinterbrühl","N","PLZ-Adressierung","extern","Ja","Ja"]
[2372,"Gießhübl","N","PLZ-Adressierung","extern","Ja","Nein"]
[2380,"Perchtoldsdorf","N","PLZ-Adressierung","extern","Ja","Ja"]
[2381,"Laab im Walde","N","PLZ-Adressierung","extern","Ja","Nein"]
[2384,"Breitenfurt bei Wien","N","PLZ-Adressierung","extern","Ja","Ja"]
[2391,"Kaltenleutgeben","N","PLZ-Adressierung","extern","Ja","Ja"]
[2392,"Sulz im Wienerwald","N","PLZ-Adressierung","extern","Ja","Ja"]
[2393,"Sittendorf","N","PLZ-Adressierung","extern","Ja","Nein"]
[2401,"Fischamend","N","PLZ-Adressierung","extern","Ja","Ja"]
[2402,"Maria Ellend","N","PLZ-Adressierung","extern","Ja","Ja"]
[2403,"Regelsbrunn","N","PLZ-Adressierung","extern","Ja","Nein"]
[2404,"Petronell","N","PLZ-Adressierung","extern","Ja","Nein"]
[2405,"Bad Deutsch Altenburg","N","PLZ-Adressierung","extern","Ja","Ja"]
[2410,"Hainburg an der Donau","N","PLZ-Adressierung","extern","Ja","Ja"]
[2412,"Wolfsthal","N","PLZ-Adressierung","extern","Ja","Nein"]
[2413,"Berg","N","PLZ-Adressierung","extern","Ja","Nein"]
[2421,"Kittsee","B","PLZ-Adressierung","extern","Ja","Ja"]
[2422,"Pama","B","PLZ-Adressierung","extern","Ja","Nein"]
[2423,"Deutsch Jahrndorf","B","PLZ-Adressierung","extern","Ja","Nein"]
[2424,"Zurndorf","B","PLZ-Adressierung","extern","Ja","Ja"]
[2425,"Nickelsdorf","B","PLZ-Adressierung","extern","Ja","Ja"]
[2431,"Kleinneusiedl","N","PLZ-Adressierung","extern","Ja","Nein"]
[2432,"Schwadorf","N","PLZ-Adressierung","extern","Ja","Ja"]
[2433,"Margarethen am Moos","N","PLZ-Adressierung","extern","Ja","Nein"]
[2434,"Götzendorf an der Leitha","N","PLZ-Adressierung","extern","Ja","Nein"]
[2435,"Ebergassing","N","PLZ-Adressierung","extern","Ja","Ja"]
[2440,"Gramatneusiedl","N","PLZ-Adressierung","extern","Ja","Ja"]
[2441,"Mitterndorf an der Fischa","N","PLZ-Adressierung","extern","Ja","Nein"]
[2442,"Unterwaltersdorf","N","PLZ-Adressierung","extern","Ja","Ja"]
[2443,"Deutsch Brodersdorf","N","PLZ-Adressierung","extern","Ja","Ja"]
[2444,"Seibersdorf","N","PLZ-Adressierung","extern","Ja","Nein"]
[2451,"Hof am Leithaberge","N","PLZ-Adressierung","extern","Ja","Ja"]
[2452,"Mannersdorf am Leithagebirge","N","PLZ-Adressierung","extern","Ja","Ja"]
[2453,"Sommerein","N","PLZ-Adressierung","extern","Ja","Nein"]
[2454,"Trautmannsdorf an der Leitha","N","PLZ-Adressierung","extern","Ja","Nein"]
[2460,"Bruck an der Leitha","N","PLZ-Adressierung","extern","Ja","Ja"]
[2462,"Wilfleinsdorf","N","PLZ-Adressierung","extern","Ja","Nein"]
[2463,"Stixneusiedl","N","PLZ-Adressierung","extern","Ja","Nein"]
[2464,"Göttlesbrunn","N","PLZ-Adressierung","extern","Ja","Nein"]
[2465,"Höflein","N","PLZ-Adressierung","extern","Ja","Nein"]
[2471,"Rohrau","N","PLZ-Adressierung","extern","Ja","Nein"]
[2472,"Prellenkirchen","N","PLZ-Adressierung","extern","Ja","Nein"]
[2473,"Potzneusiedl","B","PLZ-Adressierung","extern","Ja","Nein"]
[2474,"Gattendorf","B","PLZ-Adressierung","extern","Ja","Ja"]
[2475,"Neudorf","B","PLZ-Adressierung","extern","Ja","Nein"]
[2481,"Achau","N","PLZ-Adressierung","extern","Ja","Ja"]
[2482,"Münchendorf","N","PLZ-Adressierung","extern","Ja","Ja"]
[2483,"Ebreichsdorf","N","PLZ-Adressierung","extern","Ja","Ja"]
[2485,"Wampersdorf","N","PLZ-Adressierung","extern","Ja","Ja"]
[2486,"Pottendorf","N","PLZ-Adressierung","extern","Ja","Ja"]
[2490,"Ebenfurth","N","PLZ-Adressierung","extern","Ja","Ja"]
[2491,"Neufeld an der Leitha","B","PLZ-Adressierung","extern","Ja","Ja"]
[2492,"Eggendorf","N","PLZ-Adressierung","extern","Ja","Nein"]
[2493,"Lichtenwörth-Nadelburg","N","PLZ-Adressierung","extern","Ja","Ja"]
[2500,"Baden","N","PLZ-Adressierung","extern","Ja","Ja"]
[2502,"Baden-Leesdorf","N","PLZ-Postfach","extern","Nein","Ja"]
[2511,"Pfaffstätten","N","PLZ-Adressierung","extern","Ja","Ja"]
[2512,"Tribuswinkel","N","PLZ-Adressierung","extern","Ja","Ja"]
[2513,"Möllersdorf","N","PLZ-Postfach","extern","Nein","Ja"]
[2514,"Traiskirchen","N","PLZ-Adressierung","extern","Ja","Ja"]
[2521,"Trumau","N","PLZ-Adressierung","extern","Ja","Ja"]
[2522,"Oberwaltersdorf","N","PLZ-Adressierung","extern","Ja","Ja"]
[2523,"Tattendorf","N","PLZ-Adressierung","extern","Ja","Ja"]
[2524,"Teesdorf","N","PLZ-Adressierung","extern","Ja","Nein"]
[2525,"Günselsdorf","N","PLZ-Adressierung","extern","Ja","Ja"]
[2531,"Gaaden","N","PLZ-Adressierung","extern","Ja","Nein"]
[2532,"Heiligenkreuz","N","PLZ-Adressierung","extern","Ja","Ja"]
[2533,"Klausen-Leopoldsdorf","N","PLZ-Adressierung","extern","Ja","Nein"]
[2534,"Alland","N","PLZ-Adressierung","extern","Ja","Ja"]
[2540,"Bad Vöslau","N","PLZ-Adressierung","extern","Ja","Ja"]
[2542,"Kottingbrunn","N","PLZ-Adressierung","extern","Ja","Ja"]
[2544,"Leobersdorf","N","PLZ-Adressierung","extern","Ja","Ja"]
[2551,"Enzesfeld-Lindabrunn","N","PLZ-Adressierung","extern","Ja","Ja"]
[2552,"Hirtenberg","N","PLZ-Adressierung","extern","Ja","Ja"]
[2560,"Berndorf","N","PLZ-Adressierung","extern","Ja","Ja"]
[2562,"Berndorf, Niederösterreich","N","PLZ-Postfach","extern","Nein","Ja"]
[2563,"Pottenstein","N","PLZ-Adressierung","extern","Ja","Ja"]
[2564,"Weissenbach an der Triesting","N","PLZ-Adressierung","extern","Ja","Ja"]
[2565,"Neuhaus","N","PLZ-Adressierung","extern","Ja","Nein"]
[2571,"Altenmarkt-Thenneberg","N","PLZ-Adressierung","extern","Ja","Ja"]
[2572,"Kaumberg","N","PLZ-Adressierung","extern","Ja","Nein"]
[2601,"Sollenau","N","PLZ-Adressierung","extern","Ja","Ja"]
[2602,"Blumau-Neurißhof","N","PLZ-Adressierung","extern","Ja","Nein"]
[2603,"Felixdorf","N","PLZ-Adressierung","extern","Ja","Ja"]
[2604,"Theresienfeld","N","PLZ-Adressierung","extern","Ja","Ja"]
[2620,"Neunkirchen","N","PLZ-Adressierung","extern","Ja","Ja"]
[2622,"Neunkirchen, Niederösterreich","N","PLZ-Postfach","extern","Nein","Ja"]
[2624,"Breitenau","N","PLZ-Adressierung","extern","Ja","Nein"]
[2625,"Schwarzau am Steinfelde","N","PLZ-Adressierung","extern","Ja","Nein"]
[2630,"Ternitz","N","PLZ-Adressierung","extern","Ja","Ja"]
[2631,"Sieding-Stixenstein","N","PLZ-Adressierung","extern","Ja","Nein"]
[2632,"Wimpassing im Schwarzatale","N","PLZ-Adressierung","extern","Ja","Ja"]
[2640,"Gloggnitz","N","PLZ-Adressierung","extern","Ja","Ja"]
[2641,"Schottwien","N","PLZ-Adressierung","extern","Ja","Nein"]
[2642,"Maria Schutz","N","PLZ-Adressierung","extern","Ja","Nein"]
[2650,"Payerbach","N","PLZ-Adressierung","extern","Ja","Ja"]
[2651,"Reichenau an der Rax","N","PLZ-Adressierung","extern","Ja","Ja"]
[2654,"Prein an der Rax","N","PLZ-Adressierung","extern","Ja","Nein"]
[2661,"Naßwald","N","PLZ-Adressierung","extern","Ja","Nein"]
[2662,"Schwarzau im Gebirge","N","PLZ-Adressierung","extern","Ja","Nein"]
[2663,"Rohr im Gebirge","N","PLZ-Adressierung","extern","Ja","Nein"]
[2671,"Küb","N","PLZ-Adressierung","extern","Ja","Nein"]
[2673,"Breitenstein","N","PLZ-Adressierung","extern","Ja","Nein"]
[2680,"Semmering","N","PLZ-Adressierung","extern","Ja","Nein"]
[2700,"Wiener Neustadt","N","PLZ-Adressierung","extern","Ja","Ja"]
[2702,"Wiener Neustadt","N","PLZ-Postfach","extern","Nein","Ja"]
[2704,"Wiener Neustadt","N","PLZ-Postfach","extern","Nein","Ja"]
[2705,"Wiener Neustadt","N","PLZ-Postfach","extern","Nein","Ja"]
[2706,"Wiener Neustadt","N","InteressentenPLZ","extern","Nein","Ja"]
[2721,"Bad Fischau","N","PLZ-Adressierung","extern","Ja","Ja"]
[2722,"Winzendorf","N","PLZ-Adressierung","extern","Ja","Ja"]
[2723,"Muthmannsdorf","N","PLZ-Adressierung","extern","Ja","Nein"]
[2724,"Hohe Wand-Stollhof","N","PLZ-Adressierung","extern","Ja","Nein"]
[2731,"St. Egyden am Steinfeld","N","PLZ-Adressierung","extern","Ja","Nein"]
[2732,"Willendorf","N","PLZ-Adressierung","extern","Ja","Ja"]
[2733,"Grünbach am Schneeberg","N","PLZ-Adressierung","extern","Ja","Ja"]
[2734,"Puchberg am Schneeberg","N","PLZ-Adressierung","extern","Ja","Ja"]
[2751,"Steinabrückl","N","PLZ-Adressierung","extern","Ja","Ja"]
[2752,"Wöllersdorf","N","PLZ-Adressierung","extern","Ja","Ja"]
[2753,"Markt Piesting","N","PLZ-Adressierung","extern","Ja","Ja"]
[2754,"Waldegg","N","PLZ-Adressierung","extern","Ja","Ja"]
[2755,"Oed","N","PLZ-Adressierung","extern","Ja","Nein"]
[2761,"Miesenbach","N","PLZ-Adressierung","extern","Ja","Nein"]
[2763,"Pernitz","N","PLZ-Adressierung","extern","Ja","Ja"]
[2770,"Gutenstein","N","PLZ-Adressierung","extern","Ja","Nein"]
[2801,"Katzelsdorf","N","PLZ-Adressierung","extern","Ja","Nein"]
[2802,"Hochwolkersdorf","N","PLZ-Adressierung","extern","Ja","Nein"]
[2803,"Schwarzenbach","N","PLZ-Adressierung","extern","Ja","Nein"]
[2811,"Wiesmath","N","PLZ-Adressierung","extern","Ja","Ja"]
[2812,"Hollenthon","N","PLZ-Adressierung","extern","Ja","Nein"]
[2813,"Lichtenegg","N","PLZ-Adressierung","extern","Ja","Nein"]
[2821,"Lanzenkirchen","N","PLZ-Adressierung","extern","Ja","Ja"]
[2822,"Bad Erlach","N","PLZ-Adressierung","extern","Ja","Ja"]
[2823,"Pitten","N","PLZ-Adressierung","extern","Ja","Ja"]
[2824,"Seebenstein","N","PLZ-Adressierung","extern","Ja","Nein"]
[2831,"Warth","N","PLZ-Adressierung","extern","Ja","Ja"]
[2832,"Thernberg","N","PLZ-Adressierung","extern","Ja","Nein"]
[2833,"Bromberg","N","PLZ-Adressierung","extern","Ja","Nein"]
[2840,"Grimmenstein","N","PLZ-Adressierung","extern","Ja","Ja"]
[2842,"Edlitz","N","PLZ-Adressierung","extern","Ja","Nein"]
[2851,"Krumbach","N","PLZ-Adressierung","extern","Ja","Ja"]
[2852,"Hochneukirchen","N","PLZ-Adressierung","extern","Ja","Nein"]
[2853,"Bad Schönau","N","PLZ-Adressierung","extern","Ja","Nein"]
[2860,"Kirchschlag in der Buckligen Welt","N","PLZ-Adressierung","extern","Ja","Ja"]
[2870,"Aspang","N","PLZ-Adressierung","extern","Ja","Ja"]
[2871,"Zöbern","N","PLZ-Adressierung","extern","Ja","Nein"]
[2872,"Mönichkirchen","N","PLZ-Adressierung","extern","Ja","Nein"]
[2873,"Feistritz am Wechsel","N","PLZ-Adressierung","extern","Ja","Nein"]
[2880,"Kirchberg am Wechsel","N","PLZ-Adressierung","extern","Ja","Ja"]
[2881,"Trattenbach","N","PLZ-Adressierung","extern","Ja","Nein"]
[3001,"Mauerbach","N","PLZ-Adressierung","extern","Ja","Ja"]
[3002,"Purkersdorf","N","PLZ-Adressierung","extern","Ja","Ja"]
[3003,"Gablitz","N","PLZ-Adressierung","extern","Ja","Ja"]
[3004,"Ried am Riederberg","N","PLZ-Adressierung","extern","Ja","Nein"]
[3011,"Untertullnerbach","N","PLZ-Adressierung","extern","Ja","Ja"]
[3012,"Wolfsgraben","N","PLZ-Adressierung","extern","Ja","Ja"]
[3013,"Tullnerbach-Lawies","N","PLZ-Adressierung","extern","Ja","Ja"]
[3021,"Pressbaum","N","PLZ-Adressierung","extern","Ja","Ja"]
[3031,"Rekawinkel","N","PLZ-Adressierung","extern","Ja","Nein"]
[3032,"Eichgraben","N","PLZ-Adressierung","extern","Ja","Ja"]
[3033,"Altlengbach","N","PLZ-Adressierung","extern","Ja","Ja"]
[3034,"Maria Anzbach","N","PLZ-Adressierung","extern","Ja","Ja"]
[3040,"Neulengbach","N","PLZ-Adressierung","extern","Ja","Ja"]
[3041,"Asperhofen","N","PLZ-Adressierung","extern","Ja","Nein"]
[3042,"Würmla","N","PLZ-Adressierung","extern","Ja","Nein"]
[3051,"St. Christophen","N","PLZ-Adressierung","extern","Ja","Nein"]
[3052,"Innermanzing","N","PLZ-Adressierung","extern","Ja","Nein"]
[3053,"Laaben","N","PLZ-Adressierung","extern","Ja","Nein"]
[3061,"Ollersbach","N","PLZ-Adressierung","extern","Ja","Nein"]
[3062,"Kirchstetten","N","PLZ-Adressierung","extern","Ja","Ja"]
[3071,"Böheimkirchen","N","PLZ-Adressierung","extern","Ja","Ja"]
[3072,"Kasten bei Böheimkirchen","N","PLZ-Adressierung","extern","Ja","Nein"]
[3073,"Stössing","N","PLZ-Adressierung","extern","Ja","Ja"]
[3074,"Michelbach","N","PLZ-Adressierung","extern","Ja","Nein"]
[3100,"St. Pölten","N","PLZ-Adressierung","extern","Ja","Ja"]
[3101,"St. Pölten Postfach","N","PLZ-Postfach","extern","Nein","Ja"]
[3102,"St. Pölten","N","PLZ-Postfach","extern","Nein","Ja"]
[3103,"St. Pölten","N","PLZ-Postfach","extern","Nein","Ja"]
[3104,"St. Pölten-Harland","N","PLZ-Adressierung","extern","Ja","Nein"]
[3105,"St. Pölten-Radlberg","N","PLZ-Adressierung","extern","Ja","Nein"]
[3106,"St. Pölten-Spratzern","N","PLZ-Postfach","extern","Nein","Ja"]
[3107,"St. Pölten-Traisenpark","N","PLZ-Adressierung","extern","Ja","Ja"]
[3108,"St. Pölten-Wagram","N","PLZ-Postfach","extern","Nein","Ja"]
[3109,"St. Pölten","N","PLZ-Postfach","extern","Nein","Ja"]
[3110,"Neidling","N","PLZ-Adressierung","extern","Ja","Nein"]
[3111,"St. Pölten","N","PLZ-Postfach","extern","Nein","Ja"]
[3121,"Karlstetten","N","PLZ-Adressierung","extern","Ja","Ja"]
[3122,"Gansbach","N","PLZ-Adressierung","extern","Ja","Nein"]
[3123,"Obritzberg","N","PLZ-Adressierung","extern","Ja","Nein"]
[3124,"Oberwölbling","N","PLZ-Adressierung","extern","Ja","Nein"]
[3125,"Statzendorf","N","PLZ-Adressierung","extern","Ja","Nein"]
[3130,"Herzogenburg","N","PLZ-Adressierung","extern","Ja","Ja"]
[3131,"Getzersdorf","N","PLZ-Adressierung","extern","Ja","Nein"]
[3133,"Traismauer","N","PLZ-Adressierung","extern","Ja","Ja"]
[3134,"Nußdorf","N","PLZ-Adressierung","extern","Ja","Nein"]
[3140,"Pottenbrunn","N","PLZ-Adressierung","extern","Ja","Nein"]
[3141,"Kapelln","N","PLZ-Adressierung","extern","Ja","Nein"]
[3142,"Perschling","N","PLZ-Adressierung","extern","Ja","Nein"]
[3143,"Pyhra","N","PLZ-Adressierung","extern","Ja","Ja"]
[3144,"Wald","N","PLZ-Adressierung","extern","Ja","Nein"]
[3150,"Wilhelmsburg","N","PLZ-Adressierung","extern","Ja","Ja"]
[3151,"St. Georgen am Steinfelde","N","PLZ-Adressierung","extern","Ja","Nein"]
[3153,"Eschenau","N","PLZ-Adressierung","extern","Ja","Nein"]
[3160,"Traisen","N","PLZ-Adressierung","extern","Ja","Ja"]
[3161,"St. Veit an der Gölsen","N","PLZ-Adressierung","extern","Ja","Ja"]
[3162,"Rainfeld","N","PLZ-Adressierung","extern","Ja","Nein"]
[3163,"Rohrbach","N","PLZ-Adressierung","extern","Ja","Nein"]
[3170,"Hainfeld","N","PLZ-Adressierung","extern","Ja","Ja"]
[3171,"Kleinzell-Salzerbad","N","PLZ-Adressierung","extern","Ja","Nein"]
[3172,"Ramsau","N","PLZ-Adressierung","extern","Ja","Nein"]
[3180,"Lilienfeld","N","PLZ-Adressierung","extern","Ja","Ja"]
[3182,"Marktl, Traisental","N","InteressentenPLZ","extern","Nein","Ja"]
[3183,"Freiland","N","PLZ-Adressierung","extern","Ja","Nein"]
[3184,"Türnitz","N","PLZ-Adressierung","extern","Ja","Ja"]
[3192,"Hohenberg","N","PLZ-Adressierung","extern","Ja","Nein"]
[3193,"St. Aegyd am Neuwalde","N","PLZ-Adressierung","extern","Ja","Ja"]
[3195,"Kernhof","N","PLZ-Adressierung","extern","Ja","Nein"]
[3200,"Ober-Grafendorf","N","PLZ-Adressierung","extern","Ja","Ja"]
[3202,"Hofstetten","N","PLZ-Adressierung","extern","Ja","Nein"]
[3203,"Rabenstein an der Pielach","N","PLZ-Adressierung","extern","Ja","Ja"]
[3204,"Kirchberg an der Pielach","N","PLZ-Adressierung","extern","Ja","Ja"]
[3211,"Loich","N","PLZ-Adressierung","extern","Ja","Nein"]
[3212,"Schwarzenbach an der Pielach","N","PLZ-Adressierung","extern","Ja","Nein"]
[3213,"Frankenfels","N","PLZ-Adressierung","extern","Ja","Ja"]
[3214,"Puchenstuben","N","PLZ-Adressierung","extern","Ja","Ja"]
[3221,"Gösing an der Mariazellerbahn","N","PLZ-Adressierung","extern","Ja","Nein"]
[3222,"Annaberg","N","PLZ-Adressierung","extern","Ja","Nein"]
[3223,"Wienerbruck","N","PLZ-Adressierung","extern","Ja","Nein"]
[3224,"Mitterbach","N","PLZ-Adressierung","extern","Ja","Nein"]
[3231,"St. Margarethen an der Sierning","N","PLZ-Adressierung","extern","Ja","Nein"]
[3232,"Bischofstetten","N","PLZ-Adressierung","extern","Ja","Nein"]
[3233,"Kilb","N","PLZ-Adressierung","extern","Ja","Nein"]
[3240,"Mank","N","PLZ-Adressierung","extern","Ja","Ja"]
[3241,"Kirnberg an der Mank","N","PLZ-Adressierung","extern","Ja","Nein"]
[3242,"Texing","N","PLZ-Adressierung","extern","Ja","Nein"]
[3243,"St. Leonhard am Forst","N","PLZ-Adressierung","extern","Ja","Ja"]
[3244,"Ruprechtshofen","N","PLZ-Adressierung","extern","Ja","Nein"]
[3250,"Wieselburg","N","PLZ-Adressierung","extern","Ja","Ja"]
[3251,"Purgstall","N","PLZ-Adressierung","extern","Ja","Ja"]
[3252,"Petzenkirchen","N","PLZ-Adressierung","extern","Ja","Nein"]
[3253,"Erlauf","N","PLZ-Adressierung","extern","Ja","Nein"]
[3261,"Steinakirchen am Forst","N","PLZ-Adressierung","extern","Ja","Ja"]
[3262,"Wang","N","PLZ-Adressierung","extern","Ja","Nein"]
[3263,"Randegg","N","PLZ-Adressierung","extern","Ja","Nein"]
[3264,"Gresten","N","PLZ-Adressierung","extern","Ja","Ja"]
[3270,"Scheibbs","N","PLZ-Adressierung","extern","Ja","Ja"]
[3281,"Oberndorf an der Melk","N","PLZ-Adressierung","extern","Ja","Ja"]
[3282,"St. Georgen an der Leys","N","PLZ-Adressierung","extern","Ja","Nein"]
[3283,"St. Anton an der Jeßnitz","N","PLZ-Adressierung","extern","Ja","Nein"]
[3291,"Kienberg","N","PLZ-Adressierung","extern","Ja","Nein"]
[3292,"Gaming","N","PLZ-Adressierung","extern","Ja","Ja"]
[3293,"Lunz am See","N","PLZ-Adressierung","extern","Ja","Ja"]
[3294,"Langau","N","PLZ-Adressierung","extern","Ja","Nein"]
[3295,"Lackenhof","N","PLZ-Adressierung","extern","Ja","Nein"]
[3300,"Amstetten","N","PLZ-Adressierung","extern","Ja","Ja"]
[3302,"Amstetten, Niederösterreich","N","PLZ-Postfach","extern","Nein","Ja"]
[3304,"St. Georgen am Ybbsfelde","N","PLZ-Adressierung","extern","Ja","Nein"]
[3311,"Zeillern","N","PLZ-Adressierung","extern","Ja","Nein"]
[3312,"Oed","N","PLZ-Adressierung","extern","Ja","Nein"]
[3313,"Wallsee","N","PLZ-Adressierung","extern","Ja","Nein"]
[3314,"Strengberg","N","PLZ-Adressierung","extern","Ja","Ja"]
[3321,"Ardagger","N","PLZ-Adressierung","extern","Ja","Ja"]
[3322,"Viehdorf","N","PLZ-Adressierung","extern","Ja","Nein"]
[3323,"Neustadtl an der Donau","N","PLZ-Adressierung","extern","Ja","Nein"]
[3324,"Euratsfeld","N","PLZ-Adressierung","extern","Ja","Ja"]
[3325,"Ferschnitz","N","PLZ-Adressierung","extern","Ja","Nein"]
[3331,"Kematen","N","PLZ-Adressierung","extern","Ja","Ja"]
[3332,"Rosenau am Sonntagberg","N","PLZ-Adressierung","extern","Ja","Nein"]
[3333,"Böhlerwerk","N","PLZ-Adressierung","extern","Ja","Nein"]
[3334,"Gaflenz","O","PLZ-Adressierung","extern","Ja","Ja"]
[3335,"Weyer","O","PLZ-Adressierung","extern","Ja","Ja"]
[3340,"Waidhofen an der Ybbs","N","PLZ-Adressierung","extern","Ja","Ja"]
[3341,"Ybbsitz","N","PLZ-Adressierung","extern","Ja","Ja"]
[3342,"Opponitz","N","PLZ-Adressierung","extern","Ja","Nein"]
[3343,"Hollenstein an der Ybbs","N","PLZ-Adressierung","extern","Ja","Ja"]
[3344,"St. Georgen am Reith","N","PLZ-Adressierung","extern","Ja","Nein"]
[3345,"Göstling an der Ybbs","N","PLZ-Adressierung","extern","Ja","Ja"]
[3350,"Haag","N","PLZ-Adressierung","extern","Ja","Ja"]
[3351,"Weistrach","N","PLZ-Adressierung","extern","Ja","Nein"]
[3352,"St. Peter in der Au","N","PLZ-Adressierung","extern","Ja","Ja"]
[3353,"Seitenstetten","N","PLZ-Adressierung","extern","Ja","Ja"]
[3354,"Wolfsbach","N","PLZ-Adressierung","extern","Ja","Nein"]
[3355,"Ertl","N","PLZ-Adressierung","extern","Ja","Nein"]
[3361,"Aschbach Markt","N","PLZ-Adressierung","extern","Ja","Ja"]
[3362,"Mauer-Öhling","N","PLZ-Adressierung","extern","Ja","Nein"]
[3363,"Ulmerfeld-Hausmening","N","PLZ-Adressierung","extern","Ja","Ja"]
[3364,"Neuhofen an der Ybbs","N","PLZ-Adressierung","extern","Ja","Nein"]
[3365,"Allhartsberg","N","PLZ-Adressierung","extern","Ja","Nein"]
[3370,"Ybbs an der Donau","N","PLZ-Adressierung","extern","Ja","Ja"]
[3371,"Neumarkt an der Ybbs","N","PLZ-Adressierung","extern","Ja","Nein"]
[3372,"Blindenmarkt","N","PLZ-Adressierung","extern","Ja","Ja"]
[3373,"Kemmelbach","N","PLZ-Adressierung","extern","Ja","Ja"]
[3374,"Säusenstein","N","PLZ-Adressierung","extern","Ja","Nein"]
[3375,"Krummnußbaum","N","PLZ-Adressierung","extern","Ja","Nein"]
[3380,"Pöchlarn","N","PLZ-Adressierung","extern","Ja","Ja"]
[3381,"Golling","N","PLZ-Adressierung","extern","Ja","Nein"]
[3382,"Loosdorf","N","PLZ-Adressierung","extern","Ja","Ja"]
[3383,"Hürm","N","PLZ-Adressierung","extern","Ja","Ja"]
[3384,"Groß Sierning","N","PLZ-Adressierung","extern","Ja","Nein"]
[3385,"Prinzersdorf","N","PLZ-Adressierung","extern","Ja","Ja"]
[3386,"Hafnerbach","N","PLZ-Adressierung","extern","Ja","Nein"]
[3390,"Melk","N","PLZ-Adressierung","extern","Ja","Ja"]
[3392,"Schönbühel an der Donau","N","PLZ-Adressierung","extern","Ja","Nein"]
[3393,"Matzleinsdorf","N","PLZ-Adressierung","extern","Ja","Nein"]
[3400,"Klosterneuburg","N","PLZ-Adressierung","extern","Ja","Ja"]
[3403,"Klosterneuburg","N","PLZ-Postfach","extern","Nein","Ja"]
[3411,"Weidling","N","PLZ-Postfach","extern","Nein","Ja"]
[3412,"Kierling","N","PLZ-Postfach","extern","Nein","Ja"]
[3413,"Hintersdorf","N","PLZ-Adressierung","extern","Ja","Nein"]
[3420,"Kritzendorf","N","PLZ-Adressierung","extern","Ja","Ja"]
[3421,"Höflein an der Donau","N","PLZ-Adressierung","extern","Ja","Nein"]
[3422,"Greifenstein","N","PLZ-Adressierung","extern","Ja","Nein"]
[3423,"St. Andrä-Wördern","N","PLZ-Adressierung","extern","Ja","Ja"]
[3424,"Zeiselmauer","N","PLZ-Adressierung","extern","Ja","Ja"]
[3425,"Langenlebarn","N","PLZ-Adressierung","extern","Ja","Ja"]
[3430,"Tulln an der Donau","N","PLZ-Adressierung","extern","Ja","Ja"]
[3433,"Königstetten","N","PLZ-Adressierung","extern","Ja","Nein"]
[3434,"Tulbing","N","PLZ-Adressierung","extern","Ja","Ja"]
[3435,"Zwentendorf an der Donau","N","PLZ-Adressierung","extern","Ja","Ja"]
[3441,"Judenau","N","PLZ-Adressierung","extern","Ja","Nein"]
[3442,"Langenrohr","N","PLZ-Adressierung","extern","Ja","Nein"]
[3443,"Sieghartskirchen","N","PLZ-Adressierung","extern","Ja","Ja"]
[3451,"Michelhausen","N","PLZ-Adressierung","extern","Ja","Ja"]
[3452,"Atzenbrugg","N","PLZ-Adressierung","extern","Ja","Ja"]
[3454,"Sitzenberg-Reidling","N","PLZ-Adressierung","extern","Ja","Ja"]
[3462,"Absdorf","N","PLZ-Adressierung","extern","Ja","Ja"]
[3463,"Stetteldorf am Wagram","N","PLZ-Adressierung","extern","Ja","Nein"]
[3464,"Hausleiten","N","PLZ-Adressierung","extern","Ja","Ja"]
[3465,"Königsbrunn am Wagram","N","PLZ-Adressierung","extern","Ja","Ja"]
[3470,"Kirchberg am Wagram","N","PLZ-Adressierung","extern","Ja","Ja"]
[3471,"Großriedenthal","N","PLZ-Adressierung","extern","Ja","Ja"]
[3472,"Hohenwarth","N","PLZ-Adressierung","extern","Ja","Nein"]
[3473,"Mühlbach am Manhartsberg","N","PLZ-Adressierung","extern","Ja","Nein"]
[3474,"Altenwörth","N","PLZ-Adressierung","extern","Ja","Nein"]
[3481,"Fels am Wagram","N","PLZ-Adressierung","extern","Ja","Ja"]
[3482,"Gösing am Wagram","N","PLZ-Adressierung","extern","Ja","Nein"]
[3483,"Feuersbrunn","N","PLZ-Adressierung","extern","Ja","Nein"]
[3484,"Grafenwörth","N","PLZ-Adressierung","extern","Ja","Ja"]
[3485,"Haitzendorf","N","PLZ-Adressierung","extern","Ja","Nein"]
[3491,"Straß im Straßertale","N","PLZ-Adressierung","extern","Ja","Ja"]
[3492,"Etsdorf am Kamp","N","PLZ-Adressierung","extern","Ja","Ja"]
[3493,"Hadersdorf am Kamp","N","PLZ-Adressierung","extern","Ja","Ja"]
[3494,"Gedersdorf","N","PLZ-Adressierung","extern","Ja","Ja"]
[3495,"Rohrendorf bei Krems","N","PLZ-Adressierung","extern","Ja","Nein"]
[3500,"Krems an der Donau","N","PLZ-Adressierung","extern","Ja","Ja"]
[3502,"Krems-Lerchenfeld","N","PLZ-Postfach","extern","Nein","Ja"]
[3504,"Krems-Stein","N","PLZ-Postfach","extern","Nein","Ja"]
[3506,"Krems-Hollenburg","N","PLZ-Adressierung","extern","Ja","Nein"]
[3507,"Krems-Mitterau","N","PLZ-Postfach","extern","Nein","Ja"]
[3508,"Paudorf","N","PLZ-Adressierung","extern","Ja","Nein"]
[3511,"Furth bei Göttweig","N","PLZ-Adressierung","extern","Ja","Ja"]
[3512,"Mautern","N","PLZ-Adressierung","extern","Ja","Ja"]
[3521,"Obermeisling","N","PLZ-Adressierung","extern","Ja","Nein"]
[3522,"Lichtenau","N","PLZ-Adressierung","extern","Ja","Nein"]
[3524,"Grainbrunn","N","PLZ-Adressierung","extern","Ja","Ja"]
[3525,"Sallingberg","N","PLZ-Adressierung","extern","Ja","Nein"]
[3531,"Niedernondorf","N","PLZ-Adressierung","extern","Ja","Nein"]
[3532,"Rastenfeld","N","PLZ-Adressierung","extern","Ja","Ja"]
[3533,"Friedersbach","N","PLZ-Adressierung","extern","Ja","Nein"]
[3541,"Senftenberg","N","PLZ-Adressierung","extern","Ja","Ja"]
[3542,"Gföhl","N","PLZ-Adressierung","extern","Ja","Ja"]
[3543,"Krumau am Kamp","N","PLZ-Adressierung","extern","Ja","Nein"]
[3544,"Idolsberg","N","PLZ-Adressierung","extern","Ja","Nein"]
[3550,"Langenlois","N","PLZ-Adressierung","extern","Ja","Ja"]
[3552,"Lengenfeld","N","PLZ-Adressierung","extern","Ja","Ja"]
[3553,"Schiltern","N","PLZ-Adressierung","extern","Ja","Ja"]
[3561,"Zöbing","N","PLZ-Adressierung","extern","Ja","Nein"]
[3562,"Schönberg","N","PLZ-Adressierung","extern","Ja","Nein"]
[3564,"Plank am Kamp","N","PLZ-Adressierung","extern","Ja","Nein"]
[3571,"Gars am Kamp","N","PLZ-Adressierung","extern","Ja","Ja"]
[3572,"St. Leonhard am Hornerwald","N","PLZ-Adressierung","extern","Ja","Nein"]
[3573,"Rosenburg","N","PLZ-Adressierung","extern","Ja","Nein"]
[3580,"Horn","N","PLZ-Adressierung","extern","Ja","Ja"]
[3591,"Altenburg","N","PLZ-Adressierung","extern","Ja","Nein"]
[3592,"Röhrenbach","N","PLZ-Adressierung","extern","Ja","Nein"]
[3593,"Neupölla","N","PLZ-Adressierung","extern","Ja","Ja"]
[3594,"Franzen","N","PLZ-Adressierung","extern","Ja","Nein"]
[3595,"Brunn an der Wild","N","PLZ-Adressierung","extern","Ja","Nein"]
[3601,"Dürnstein","N","PLZ-Adressierung","extern","Ja","Nein"]
[3602,"Rossatz","N","PLZ-Adressierung","extern","Ja","Nein"]
[3610,"Weißenkirchen in der Wachau","N","PLZ-Adressierung","extern","Ja","Ja"]
[3611,"Großheinrichschlag","N","PLZ-Adressierung","extern","Ja","Ja"]
[3613,"Albrechtsberg an der Großen Krems","N","PLZ-Adressierung","extern","Ja","Nein"]
[3620,"Spitz","N","PLZ-Adressierung","extern","Ja","Ja"]
[3621,"Mitterarnsdorf","N","PLZ-Adressierung","extern","Ja","Nein"]
[3622,"Mühldorf","N","PLZ-Adressierung","extern","Ja","Ja"]
[3623,"Kottes","N","PLZ-Adressierung","extern","Ja","Nein"]
[3631,"Ottenschlag","N","PLZ-Adressierung","extern","Ja","Ja"]
[3632,"Traunstein","N","PLZ-Adressierung","extern","Ja","Ja"]
[3633,"Schönbach","N","PLZ-Adressierung","extern","Ja","Nein"]
[3641,"Aggsbach Markt","N","PLZ-Adressierung","extern","Ja","Nein"]
[3642,"Aggsbach Dorf","N","PLZ-Adressierung","extern","Ja","Nein"]
[3643,"Maria Laach am Jauerling","N","PLZ-Adressierung","extern","Ja","Ja"]
[3644,"Emmersdorf an der Donau","N","PLZ-Adressierung","extern","Ja","Nein"]
[3650,"Pöggstall","N","PLZ-Adressierung","extern","Ja","Ja"]
[3652,"Leiben","N","PLZ-Adressierung","extern","Ja","Nein"]
[3653,"Weiten","N","PLZ-Adressierung","extern","Ja","Ja"]
[3654,"Raxendorf","N","PLZ-Adressierung","extern","Ja","Ja"]
[3660,"Klein-Pöchlarn","N","PLZ-Adressierung","extern","Ja","Nein"]
[3661,"Artstetten","N","PLZ-Adressierung","extern","Ja","Ja"]
[3662,"Münichreith","N","PLZ-Adressierung","extern","Ja","Nein"]
[3663,"Laimbach am Ostrong","N","PLZ-Adressierung","extern","Ja","Nein"]
[3664,"Martinsberg","N","PLZ-Adressierung","extern","Ja","Ja"]
[3665,"Gutenbrunn","N","PLZ-Adressierung","extern","Ja","Nein"]
[3671,"Marbach an der Donau","N","PLZ-Adressierung","extern","Ja","Ja"]
[3672,"Maria Taferl","N","PLZ-Adressierung","extern","Ja","Ja"]
[3680,"Persenbeug","N","PLZ-Adressierung","extern","Ja","Ja"]
[3683,"Yspertal","N","PLZ-Adressierung","extern","Ja","Ja"]
[3684,"St. Oswald","N","PLZ-Adressierung","extern","Ja","Nein"]
[3691,"Nöchling","N","PLZ-Adressierung","extern","Ja","Nein"]
[3701,"Großweikersdorf","N","PLZ-Adressierung","extern","Ja","Ja"]
[3702,"Niederrußbach","N","PLZ-Adressierung","extern","Ja","Nein"]
[3704,"Glaubendorf","N","PLZ-Adressierung","extern","Ja","Nein"]
[3710,"Ziersdorf","N","PLZ-Adressierung","extern","Ja","Ja"]
[3711,"Großmeiseldorf","N","PLZ-Adressierung","extern","Ja","Nein"]
[3712,"Maissau","N","PLZ-Adressierung","extern","Ja","Ja"]
[3713,"Harmannsdorf","N","PLZ-Adressierung","extern","Ja","Nein"]
[3714,"Sitzendorf an der Schmida","N","PLZ-Adressierung","extern","Ja","Nein"]
[3720,"Ravelsbach","N","PLZ-Adressierung","extern","Ja","Nein"]
[3721,"Limberg","N","PLZ-Adressierung","extern","Ja","Nein"]
[3722,"Straning","N","PLZ-Adressierung","extern","Ja","Nein"]
[3730,"Eggenburg","N","PLZ-Adressierung","extern","Ja","Ja"]
[3741,"Pulkau","N","PLZ-Adressierung","extern","Ja","Ja"]
[3742,"Theras","N","PLZ-Adressierung","extern","Ja","Nein"]
[3743,"Röschitz","N","PLZ-Adressierung","extern","Ja","Nein"]
[3744,"Stockern","N","PLZ-Adressierung","extern","Ja","Nein"]
[3751,"Sigmundsherberg","N","PLZ-Adressierung","extern","Ja","Ja"]
[3752,"Walkenstein","N","PLZ-Adressierung","extern","Ja","Nein"]
[3753,"Hötzelsdorf","N","PLZ-Adressierung","extern","Ja","Nein"]
[3754,"Irnfritz","N","PLZ-Adressierung","extern","Ja","Nein"]
[3761,"Messern","N","PLZ-Adressierung","extern","Ja","Nein"]
[3762,"Ludweis","N","PLZ-Adressierung","extern","Ja","Nein"]
[3763,"Japons","N","PLZ-Adressierung","extern","Ja","Ja"]
[3800,"Göpfritz an der Wild","N","PLZ-Adressierung","extern","Ja","Nein"]
[3804,"Allentsteig","N","PLZ-Adressierung","extern","Ja","Ja"]
[3811,"Kirchberg an der Wild","N","PLZ-Adressierung","extern","Ja","Nein"]
[3812,"Groß Siegharts","N","PLZ-Adressierung","extern","Ja","Ja"]
[3813,"Dietmanns","N","PLZ-Adressierung","extern","Ja","Nein"]
[3814,"Aigen","N","PLZ-Adressierung","extern","Ja","Nein"]
[3820,"Raabs an der Thaya","N","PLZ-Adressierung","extern","Ja","Ja"]
[3822,"Karlstein an der Thaya","N","PLZ-Adressierung","extern","Ja","Nein"]
[3823,"Weikertschlag an der Thaya","N","PLZ-Adressierung","extern","Ja","Nein"]
[3824,"Großau","N","PLZ-Adressierung","extern","Ja","Nein"]
[3830,"Waidhofen an der Thaya","N","PLZ-Adressierung","extern","Ja","Ja"]
[3834,"Pfaffenschlag bei Waidhofen an der Thaya","N","PLZ-Adressierung","extern","Ja","Nein"]
[3841,"Windigsteig","N","PLZ-Adressierung","extern","Ja","Nein"]
[3842,"Thaya","N","PLZ-Adressierung","extern","Ja","Nein"]
[3843,"Dobersberg","N","PLZ-Adressierung","extern","Ja","Ja"]
[3844,"Waldkirchen an der Thaya","N","PLZ-Adressierung","extern","Ja","Nein"]
[3851,"Kautzen","N","PLZ-Adressierung","extern","Ja","Nein"]
[3852,"Gastern","N","PLZ-Adressierung","extern","Ja","Ja"]
[3860,"Heidenreichstein","N","PLZ-Adressierung","extern","Ja","Ja"]
[3861,"Eggern","N","PLZ-Adressierung","extern","Ja","Nein"]
[3862,"Eisgarn","N","PLZ-Adressierung","extern","Ja","Nein"]
[3863,"Reingers","N","PLZ-Adressierung","extern","Ja","Nein"]
[3871,"Nagelberg","N","PLZ-Adressierung","extern","Ja","Ja"]
[3872,"Langegg","N","PLZ-Adressierung","extern","Ja","Nein"]
[3873,"Brand","N","PLZ-Adressierung","extern","Ja","Nein"]
[3874,"Litschau","N","PLZ-Adressierung","extern","Ja","Ja"]
[3900,"Schwarzenau","N","PLZ-Adressierung","extern","Ja","Ja"]
[3902,"Vitis","N","PLZ-Adressierung","extern","Ja","Ja"]
[3903,"Echsenbach","N","PLZ-Adressierung","extern","Ja","Ja"]
[3910,"Zwettl","N","PLZ-Adressierung","extern","Ja","Ja"]
[3911,"Rappottenstein","N","PLZ-Adressierung","extern","Ja","Ja"]
[3912,"Grafenschlag","N","PLZ-Adressierung","extern","Ja","Nein"]
[3913,"Großgöttfritz","N","PLZ-Adressierung","extern","Ja","Nein"]
[3914,"Waldhausen","N","PLZ-Adressierung","extern","Ja","Nein"]
[3920,"Groß Gerungs","N","PLZ-Adressierung","extern","Ja","Ja"]
[3921,"Langschlag","N","PLZ-Adressierung","extern","Ja","Nein"]
[3922,"Großschönau","N","PLZ-Adressierung","extern","Ja","Nein"]
[3923,"Jagenbach","N","PLZ-Adressierung","extern","Ja","Nein"]
[3924,"Rosenau Schloß","N","PLZ-Adressierung","extern","Ja","Nein"]
[3925,"Arbesbach","N","PLZ-Adressierung","extern","Ja","Ja"]
[3931,"Schweiggers","N","PLZ-Adressierung","extern","Ja","Ja"]
[3932,"Kirchberg am Walde","N","PLZ-Adressierung","extern","Ja","Nein"]
[3942,"Hirschbach","N","PLZ-Adressierung","extern","Ja","Nein"]
[3943,"Schrems","N","PLZ-Adressierung","extern","Ja","Ja"]
[3944,"Pürbach","N","PLZ-Adressierung","extern","Ja","Nein"]
[3945,"Hoheneich","N","PLZ-Adressierung","extern","Ja","Nein"]
[3950,"Gmünd","N","PLZ-Adressierung","extern","Ja","Ja"]
[3961,"Waldenstein","N","PLZ-Adressierung","extern","Ja","Nein"]
[3962,"Heinrichs bei Weitra","N","PLZ-Adressierung","extern","Ja","Nein"]
[3970,"Weitra","N","PLZ-Adressierung","extern","Ja","Ja"]
[3971,"St. Martin","N","PLZ-Adressierung","extern","Ja","Nein"]
[3972,"Bad Großpertholz","N","PLZ-Adressierung","extern","Ja","Ja"]
[3973,"Karlstift","N","PLZ-Adressierung","extern","Ja","Nein"]
[4010,"Linz, Donau","O","PLZ-Postfach","extern","Nein","Ja"]
[4013,"Linz, Donau","O","PLZ-Postfach","extern","Nein","Ja"]
[4014,"Linz, Donau","O","PLZ-Postfach","extern","Nein","Ja"]
[4015,"Linz, Donau","O","PLZ-Postfach","extern","Nein","Ja"]
[4017,"Linz, Donau","O","PLZ-Postfach","extern","Nein","Ja"]
[4018,"Linz, Donau","O","PLZ-Postfach","extern","Nein","Ja"]
[4020,"Linz","O","PLZ-Adressierung","extern","Ja","Ja"]
[4021,"Linz, Donau Postfach","O","PLZ-Postfach","extern","Nein","Ja"]
[4025,"Linz, Donau","O","PLZ-Postfach","extern","Nein","Ja"]
[4026,"Linz, Donau","O","PLZ-Postfach","extern","Nein","Ja"]
[4029,"Linz, Donau","O","PLZ-Postfach","extern","Nein","Ja"]
[4030,"Linz","O","PLZ-Adressierung","extern","Ja","Ja"]
[4031,"Linz, Donau Postfach","O","PLZ-Postfach","extern","Nein","Ja"]
[4033,"Linz-Ebelsberg","O","PLZ-Postfach","extern","Nein","Ja"]
[4034,"Linz, Donau","O","PLZ-Postfach","extern","Nein","Ja"]
[4040,"Linz","O","PLZ-Adressierung","extern","Ja","Ja"]
[4041,"Linz, Donau Postfach","O","PLZ-Postfach","extern","Nein","Ja"]
[4044,"Linz, Donau","O","PLZ-Postfach","extern","Nein","Ja"]
[4046,"Linz, Donau","O","PLZ-Postfach","extern","Nein","Ja"]
[4048,"Puchenau","O","PLZ-Adressierung","extern","Ja","Ja"]
[4050,"Traun","O","PLZ-Adressierung","extern","Ja","Ja"]
[4052,"Ansfelden","O","PLZ-Adressierung","extern","Ja","Ja"]
[4053,"Haid","O","PLZ-Adressierung","extern","Ja","Ja"]
[4055,"Pucking","O","PLZ-Adressierung","extern","Ja","Nein"]
[4059,"Leonding","O","PLZ-Postfach","extern","Nein","Ja"]
[4060,"Leonding","O","PLZ-Adressierung","extern","Ja","Ja"]
[4061,"Pasching","O","PLZ-Adressierung","extern","Ja","Ja"]
[4062,"Thening","O","PLZ-Adressierung","extern","Ja","Nein"]
[4063,"Hörsching","O","PLZ-Adressierung","extern","Ja","Ja"]
[4064,"Oftering","O","PLZ-Adressierung","extern","Ja","Ja"]
[4066,"Pasching","O","PLZ-Postfach","extern","Nein","Ja"]
[4069,"Leonding","O","PLZ-Postfach","extern","Nein","Ja"]
[4070,"Eferding","O","PLZ-Adressierung","extern","Ja","Ja"]
[4072,"Alkoven","O","PLZ-Adressierung","extern","Ja","Ja"]
[4073,"Wilhering","O","PLZ-Adressierung","extern","Ja","Ja"]
[4074,"Stroheim","O","PLZ-Adressierung","extern","Ja","Nein"]
[4075,"Breitenaich","O","PLZ-Adressierung","extern","Ja","Nein"]
[4076,"St. Marienkirchen an der Polsenz","O","PLZ-Adressierung","extern","Ja","Nein"]
[4081,"Hartkirchen","O","PLZ-Adressierung","extern","Ja","Ja"]
[4082,"Aschach an der Donau","O","PLZ-Adressierung","extern","Ja","Nein"]
[4083,"Haibach ob der Donau","O","PLZ-Adressierung","extern","Ja","Ja"]
[4084,"St. Agatha","O","PLZ-Adressierung","extern","Ja","Nein"]
[4085,"Wesenufer","O","PLZ-Adressierung","extern","Ja","Ja"]
[4090,"Engelhartszell","O","PLZ-Adressierung","extern","Ja","Ja"]
[4091,"Vichtenstein","O","PLZ-Adressierung","extern","Ja","Nein"]
[4092,"Esternberg","O","PLZ-Adressierung","extern","Ja","Ja"]
[4100,"Ottensheim","O","PLZ-Adressierung","extern","Ja","Ja"]
[4101,"Feldkirchen an der Donau","O","PLZ-Adressierung","extern","Ja","Ja"]
[4111,"Walding","O","PLZ-Adressierung","extern","Ja","Ja"]
[4112,"Rottenegg","O","PLZ-Adressierung","extern","Ja","Nein"]
[4113,"St. Martin im Mühlkreis","O","PLZ-Adressierung","extern","Ja","Ja"]
[4114,"Neuhaus an der Donau","O","PLZ-Adressierung","extern","Ja","Nein"]
[4115,"Kleinzell im Mühlkreis","O","PLZ-Adressierung","extern","Ja","Nein"]
[4120,"Neufelden","O","PLZ-Adressierung","extern","Ja","Ja"]
[4121,"Altenfelden","O","PLZ-Adressierung","extern","Ja","Ja"]
[4122,"Arnreit","O","PLZ-Adressierung","extern","Ja","Nein"]
[4131,"Obermühl","O","PLZ-Adressierung","extern","Ja","Nein"]
[4132,"Lembach im Mühlkreis","O","PLZ-Adressierung","extern","Ja","Ja"]
[4133,"Niederkappel","O","PLZ-Adressierung","extern","Ja","Nein"]
[4134,"Putzleinsdorf","O","PLZ-Adressierung","extern","Ja","Nein"]
[4141,"Pfarrkirchen im Mühlkreis","O","PLZ-Adressierung","extern","Ja","Nein"]
[4142,"Hofkirchen im Mühlkreis","O","PLZ-Adressierung","extern","Ja","Ja"]
[4143,"Neustift im Mühlkreis","O","PLZ-Adressierung","extern","Ja","Ja"]
[4144,"Oberkappel","O","PLZ-Adressierung","extern","Ja","Nein"]
[4150,"Rohrbach in Oberösterreich","O","PLZ-Adressierung","extern","Ja","Ja"]
[4152,"Sarleinsbach","O","PLZ-Adressierung","extern","Ja","Nein"]
[4153,"Peilstein im Mühlviertel","O","PLZ-Adressierung","extern","Ja","Ja"]
[4154,"Kollerschlag","O","PLZ-Adressierung","extern","Ja","Nein"]
[4160,"Aigen im Mühlkreis","O","PLZ-Adressierung","extern","Ja","Ja"]
[4161,"Ulrichsberg","O","PLZ-Adressierung","extern","Ja","Ja"]
[4162,"Julbach","O","PLZ-Adressierung","extern","Ja","Nein"]
[4163,"Klaffer am Hochficht","O","PLZ-Adressierung","extern","Ja","Nein"]
[4164,"Schwarzenberg am Böhmerwald","O","PLZ-Adressierung","extern","Ja","Nein"]
[4170,"Haslach an der Mühl","O","PLZ-Adressierung","extern","Ja","Ja"]
[4171,"St. Peter am Wimberg","O","PLZ-Adressierung","extern","Ja","Ja"]
[4172,"St. Johann am Wimberg","O","PLZ-Adressierung","extern","Ja","Nein"]
[4173,"St. Veit im Mühlkreis","O","PLZ-Adressierung","extern","Ja","Nein"]
[4174,"Niederwaldkirchen","O","PLZ-Adressierung","extern","Ja","Nein"]
[4175,"Herzogsdorf","O","PLZ-Adressierung","extern","Ja","Ja"]
[4180,"Zwettl an der Rodl","O","PLZ-Adressierung","extern","Ja","Ja"]
[4181,"Oberneukirchen","O","PLZ-Adressierung","extern","Ja","Ja"]
[4182,"Waxenberg","O","PLZ-Adressierung","extern","Ja","Nein"]
[4183,"Traberg","O","PLZ-Adressierung","extern","Ja","Nein"]
[4184,"Helfenberg","O","PLZ-Adressierung","extern","Ja","Nein"]
[4190,"Bad Leonfelden","O","PLZ-Adressierung","extern","Ja","Ja"]
[4191,"Vorderweißenbach","O","PLZ-Adressierung","extern","Ja","Nein"]
[4192,"Schenkenfelden","O","PLZ-Adressierung","extern","Ja","Ja"]
[4193,"Reichenthal","O","PLZ-Adressierung","extern","Ja","Ja"]
[4201,"Gramastetten","O","PLZ-Adressierung","extern","Ja","Ja"]
[4202,"Hellmonsödt","O","PLZ-Adressierung","extern","Ja","Ja"]
[4203,"Altenberg bei Linz","O","PLZ-Adressierung","extern","Ja","Ja"]
[4204,"Reichenau im Mühlkreis","O","PLZ-Adressierung","extern","Ja","Nein"]
[4209,"Engerwitzdorf","O","PLZ-Adressierung","extern","Ja","Nein"]
[4210,"Gallneukirchen","O","PLZ-Adressierung","extern","Ja","Ja"]
[4211,"Alberndorf in der Riedmark","O","PLZ-Adressierung","extern","Ja","Ja"]
[4212,"Neumarkt im Mühlkreis","O","PLZ-Adressierung","extern","Ja","Ja"]
[4221,"Steyregg","O","PLZ-Adressierung","extern","Ja","Ja"]
[4222,"St. Georgen an der Gusen","O","PLZ-Adressierung","extern","Ja","Ja"]
[4223,"Katsdorf","O","PLZ-Adressierung","extern","Ja","Ja"]
[4224,"Wartberg ob der Aist","O","PLZ-Adressierung","extern","Ja","Ja"]
[4230,"Pregarten","O","PLZ-Adressierung","extern","Ja","Ja"]
[4231,"Untergaisbach","O","PLZ-Adressierung","extern","Ja","Nein"]
[4232,"Hagenberg im Mühlkreis","O","PLZ-Adressierung","extern","Ja","Ja"]
[4240,"Freistadt","O","PLZ-Adressierung","extern","Ja","Ja"]
[4242,"Hirschbach im Mühlkreis","O","PLZ-Adressierung","extern","Ja","Ja"]
[4251,"Sandl","O","PLZ-Adressierung","extern","Ja","Ja"]
[4252,"Liebenau","O","PLZ-Adressierung","extern","Ja","Nein"]
[4261,"Rainbach im Mühlkreis","O","PLZ-Adressierung","extern","Ja","Ja"]
[4262,"Leopoldschlag","O","PLZ-Adressierung","extern","Ja","Nein"]
[4263,"Windhaag bei Freistadt","O","PLZ-Adressierung","extern","Ja","Ja"]
[4264,"Grünbach","O","PLZ-Adressierung","extern","Ja","Nein"]
[4271,"St. Oswald bei Freistadt","O","PLZ-Adressierung","extern","Ja","Nein"]
[4272,"Weitersfelden","O","PLZ-Adressierung","extern","Ja","Nein"]
[4273,"Unterweißenbach","O","PLZ-Adressierung","extern","Ja","Ja"]
[4274,"Schönau im Mühlkreis","O","PLZ-Adressierung","extern","Ja","Nein"]
[4280,"Königswiesen","O","PLZ-Adressierung","extern","Ja","Ja"]
[4281,"Mönchdorf","O","PLZ-Adressierung","extern","Ja","Nein"]
[4282,"Pierbach","O","PLZ-Adressierung","extern","Ja","Nein"]
[4283,"Bad Zell","O","PLZ-Adressierung","extern","Ja","Ja"]
[4284,"Tragwein","O","PLZ-Adressierung","extern","Ja","Nein"]
[4291,"Lasberg","O","PLZ-Adressierung","extern","Ja","Ja"]
[4292,"Kefermarkt","O","PLZ-Adressierung","extern","Ja","Nein"]
[4293,"Gutau","O","PLZ-Adressierung","extern","Ja","Ja"]
[4294,"St. Leonhard bei Freistadt","O","PLZ-Adressierung","extern","Ja","Nein"]
[4300,"St. Valentin","N","PLZ-Adressierung","extern","Ja","Ja"]
[4303,"St. Pantaleon","N","PLZ-Adressierung","extern","Ja","Nein"]
[4310,"Mauthausen","O","PLZ-Adressierung","extern","Ja","Ja"]
[4311,"Schwertberg","O","PLZ-Adressierung","extern","Ja","Ja"]
[4312,"Ried in der Riedmark","O","PLZ-Adressierung","extern","Ja","Ja"]
[4320,"Perg","O","PLZ-Adressierung","extern","Ja","Ja"]
[4322,"Windhaag bei Perg","O","PLZ-Adressierung","extern","Ja","Nein"]
[4323,"Münzbach","O","PLZ-Adressierung","extern","Ja","Nein"]
[4324,"Rechberg","O","PLZ-Adressierung","extern","Ja","Nein"]
[4331,"Naarn","O","PLZ-Adressierung","extern","Ja","Ja"]
[4332,"Au an der Donau","O","PLZ-Adressierung","extern","Ja","Nein"]
[4341,"Arbing","O","PLZ-Adressierung","extern","Ja","Nein"]
[4342,"Baumgartenberg","O","PLZ-Adressierung","extern","Ja","Nein"]
[4343,"Mitterkirchen","O","PLZ-Adressierung","extern","Ja","Ja"]
[4351,"Saxen","O","PLZ-Adressierung","extern","Ja","Nein"]
[4352,"Klam","O","PLZ-Adressierung","extern","Ja","Nein"]
[4360,"Grein","O","PLZ-Adressierung","extern","Ja","Ja"]
[4362,"Bad Kreuzen","O","PLZ-Adressierung","extern","Ja","Ja"]
[4363,"Pabneukirchen","O","PLZ-Adressierung","extern","Ja","Ja"]
[4364,"St. Thomas","O","PLZ-Adressierung","extern","Ja","Nein"]
[4371,"Dimbach","O","PLZ-Adressierung","extern","Ja","Nein"]
[4372,"St. Georgen am Walde","O","PLZ-Adressierung","extern","Ja","Ja"]
[4381,"St. Nikola an der Donau","O","PLZ-Adressierung","extern","Ja","Nein"]
[4382,"Sarmingstein","O","PLZ-Adressierung","extern","Ja","Nein"]
[4391,"Waldhausen im Strudengau","O","PLZ-Adressierung","extern","Ja","Ja"]
[4392,"Dorfstetten","N","PLZ-Adressierung","extern","Ja","Nein"]
[4400,"Steyr","O","PLZ-Adressierung","extern","Ja","Ja"]
[4401,"Steyr Postfach","O","PLZ-Postfach","extern","Nein","Ja"]
[4402,"Steyr","O","PLZ-Postfach","extern","Nein","Ja"]
[4403,"Steyr","O","PLZ-Postfach","extern","Nein","Ja"]
[4405,"Steyr-Münichholz","O","PLZ-Postfach","extern","Nein","Ja"]
[4406,"Steyr","O","PLZ-Postfach","extern","Nein","Ja"]
[4407,"Steyr-Gleink","O","PLZ-Adressierung","extern","Ja","Ja"]
[4411,"Christkindl","O","PLZ-Postfach","extern","Nein","Ja"]
[4421,"Aschach an der Steyr","O","PLZ-Adressierung","extern","Ja","Nein"]
[4431,"Haidershofen","N","PLZ-Adressierung","extern","Ja","Ja"]
[4432,"Ernsthofen","N","PLZ-Adressierung","extern","Ja","Nein"]
[4441,"Behamberg","N","PLZ-Adressierung","extern","Ja","Nein"]
[4442,"Kleinraming","O","PLZ-Adressierung","extern","Ja","Nein"]
[4443,"Maria Neustift","O","PLZ-Adressierung","extern","Ja","Ja"]
[4451,"Garsten","O","PLZ-Adressierung","extern","Ja","Ja"]
[4452,"Ternberg","O","PLZ-Adressierung","extern","Ja","Ja"]
[4453,"Trattenbach","O","PLZ-Adressierung","extern","Ja","Nein"]
[4460,"Losenstein","O","PLZ-Adressierung","extern","Ja","Nein"]
[4461,"Laussa","O","PLZ-Adressierung","extern","Ja","Nein"]
[4462,"Reichraming","O","PLZ-Adressierung","extern","Ja","Nein"]
[4463,"Großraming","O","PLZ-Adressierung","extern","Ja","Ja"]
[4464,"Kleinreifling","O","PLZ-Adressierung","extern","Ja","Nein"]
[4470,"Enns","O","PLZ-Adressierung","extern","Ja","Ja"]
[4481,"Asten","O","PLZ-Adressierung","extern","Ja","Ja"]
[4482,"Ennsdorf","N","PLZ-Adressierung","extern","Ja","Nein"]
[4483,"Hargelsberg","O","PLZ-Adressierung","extern","Ja","Nein"]
[4484,"Kronstorf","O","PLZ-Adressierung","extern","Ja","Ja"]
[4490,"St. Florian","O","PLZ-Adressierung","extern","Ja","Ja"]
[4491,"Niederneukirchen","O","PLZ-Adressierung","extern","Ja","Ja"]
[4492,"Hofkirchen im Traunkreis","O","PLZ-Adressierung","extern","Ja","Nein"]
[4493,"Wolfern","O","PLZ-Adressierung","extern","Ja","Nein"]
[4501,"Neuhofen an der Krems","O","PLZ-Adressierung","extern","Ja","Ja"]
[4502,"St. Marien","O","PLZ-Adressierung","extern","Ja","Ja"]
[4511,"Allhaming","O","PLZ-Adressierung","extern","Ja","Nein"]
[4521,"Schiedlberg","O","PLZ-Adressierung","extern","Ja","Nein"]
[4522,"Sierning","O","PLZ-Adressierung","extern","Ja","Ja"]
[4523,"Neuzeug","O","PLZ-Adressierung","extern","Ja","Nein"]
[4531,"Kematen an der Krems","O","PLZ-Adressierung","extern","Ja","Ja"]
[4532,"Rohr im Kremstal","O","PLZ-Adressierung","extern","Ja","Nein"]
[4533,"Piberbach","O","PLZ-Adressierung","extern","Ja","Nein"]
[4540,"Bad Hall","O","PLZ-Adressierung","extern","Ja","Ja"]
[4541,"Adlwang","O","PLZ-Adressierung","extern","Ja","Nein"]
[4542,"Nußbach","O","PLZ-Adressierung","extern","Ja","Nein"]
[4550,"Kremsmünster","O","PLZ-Adressierung","extern","Ja","Ja"]
[4551,"Ried im Traunkreis","O","PLZ-Adressierung","extern","Ja","Nein"]
[4552,"Wartberg an der Krems","O","PLZ-Adressierung","extern","Ja","Ja"]
[4553,"Schlierbach","O","PLZ-Adressierung","extern","Ja","Nein"]
[4560,"Kirchdorf an der Krems","O","PLZ-Adressierung","extern","Ja","Ja"]
[4562,"Steinbach am Ziehberg","O","PLZ-Adressierung","extern","Ja","Nein"]
[4563,"Micheldorf","O","PLZ-Adressierung","extern","Ja","Ja"]
[4564,"Klaus an der Pyhrnbahn","O","PLZ-Adressierung","extern","Ja","Nein"]
[4571,"Steyrling","O","PLZ-Adressierung","extern","Ja","Nein"]
[4572,"St. Pankraz","O","PLZ-Adressierung","extern","Ja","Nein"]
[4573,"Hinterstoder","O","PLZ-Adressierung","extern","Ja","Ja"]
[4574,"Vorderstoder","O","PLZ-Adressierung","extern","Ja","Nein"]
[4575,"Roßleithen","O","PLZ-Adressierung","extern","Ja","Nein"]
[4580,"Windischgarsten","O","PLZ-Adressierung","extern","Ja","Ja"]
[4581,"Rosenau am Hengstpaß","O","PLZ-Adressierung","extern","Ja","Nein"]
[4582,"Spital am Pyhrn","O","PLZ-Adressierung","extern","Ja","Ja"]
[4591,"Molln","O","PLZ-Adressierung","extern","Ja","Ja"]
[4592,"Leonstein","O","PLZ-Adressierung","extern","Ja","Nein"]
[4593,"Obergrünburg","O","PLZ-Adressierung","extern","Ja","Nein"]
[4594,"Grünburg","O","PLZ-Adressierung","extern","Ja","Ja"]
[4595,"Waldneukirchen","O","PLZ-Adressierung","extern","Ja","Nein"]
[4600,"Wels","O","PLZ-Adressierung","extern","Ja","Ja"]
[4601,"Wels","O","PLZ-Postfach","extern","Nein","Ja"]
[4602,"Wels Postfach","O","PLZ-Postfach","extern","Nein","Ja"]
[4603,"Wels","O","PLZ-Postfach","extern","Nein","Ja"]
[4604,"Wels","O","PLZ-Postfach","extern","Nein","Ja"]
[4605,"Wels","O","PLZ-Postfach","extern","Nein","Ja"]
[4606,"Wels","O","PLZ-Postfach","extern","Nein","Ja"]
[4607,"Wels","O","PLZ-Postfach","extern","Nein","Ja"]
[4609,"Thalheim bei Wels","O","PLZ-Postfach","extern","Nein","Ja"]
[4611,"Buchkirchen","O","PLZ-Adressierung","extern","Ja","Nein"]
[4612,"Scharten","O","PLZ-Adressierung","extern","Ja","Nein"]
[4613,"Mistelbach bei Wels","O","PLZ-Adressierung","extern","Ja","Nein"]
[4614,"Marchtrenk","O","PLZ-Adressierung","extern","Ja","Ja"]
[4615,"Holzhausen","O","PLZ-Adressierung","extern","Ja","Nein"]
[4616,"Weißkirchen","O","PLZ-Adressierung","extern","Ja","Nein"]
[4621,"Sipbachzell","O","PLZ-Adressierung","extern","Ja","Nein"]
[4622,"Eggendorf im Traunkreis","O","PLZ-Adressierung","extern","Ja","Nein"]
[4623,"Gunskirchen","O","PLZ-Adressierung","extern","Ja","Ja"]
[4624,"Pennewang","O","PLZ-Adressierung","extern","Ja","Nein"]
[4625,"Offenhausen","O","PLZ-Adressierung","extern","Ja","Nein"]
[4631,"Krenglbach","O","PLZ-Adressierung","extern","Ja","Nein"]
[4632,"Pichl bei Wels","O","PLZ-Adressierung","extern","Ja","Ja"]
[4633,"Kematen am Innbach","O","PLZ-Adressierung","extern","Ja","Nein"]
[4641,"Steinhaus","O","PLZ-Adressierung","extern","Ja","Nein"]
[4642,"Sattledt","O","PLZ-Adressierung","extern","Ja","Ja"]
[4643,"Pettenbach","O","PLZ-Adressierung","extern","Ja","Ja"]
[4644,"Scharnstein","O","PLZ-Adressierung","extern","Ja","Ja"]
[4645,"Grünau im Almtal","O","PLZ-Adressierung","extern","Ja","Nein"]
[4650,"Lambach","O","PLZ-Adressierung","extern","Ja","Ja"]
[4651,"Stadl-Paura","O","PLZ-Adressierung","extern","Ja","Ja"]
[4652,"Steinerkirchen an der Traun","O","PLZ-Adressierung","extern","Ja","Ja"]
[4653,"Eberstalzell","O","PLZ-Adressierung","extern","Ja","Nein"]
[4654,"Bad Wimsbach-Neydharting","O","PLZ-Adressierung","extern","Ja","Nein"]
[4655,"Vorchdorf","O","PLZ-Adressierung","extern","Ja","Ja"]
[4656,"Kirchham","O","PLZ-Adressierung","extern","Ja","Ja"]
[4661,"Roitham","O","PLZ-Adressierung","extern","Ja","Ja"]
[4662,"Steyrermühl","O","PLZ-Adressierung","extern","Ja","Nein"]
[4663,"Laakirchen","O","PLZ-Adressierung","extern","Ja","Ja"]
[4664,"Oberweis","O","PLZ-Adressierung","extern","Ja","Ja"]
[4671,"Neukirchen bei Lambach","O","PLZ-Adressierung","extern","Ja","Nein"]
[4672,"Bachmanning","O","PLZ-Adressierung","extern","Ja","Nein"]
[4673,"Gaspoltshofen","O","PLZ-Adressierung","extern","Ja","Ja"]
[4674,"Altenhof am Hausruck","O","PLZ-Adressierung","extern","Ja","Nein"]
[4675,"Weibern","O","PLZ-Adressierung","extern","Ja","Ja"]
[4676,"Aistersheim","O","PLZ-Adressierung","extern","Ja","Nein"]
[4680,"Haag am Hausruck","O","PLZ-Adressierung","extern","Ja","Ja"]
[4681,"Rottenbach","O","PLZ-Adressierung","extern","Ja","Nein"]
[4682,"Geboltskirchen","O","PLZ-Adressierung","extern","Ja","Nein"]
[4690,"Schwanenstadt","O","PLZ-Adressierung","extern","Ja","Ja"]
[4691,"Breitenschützing","O","PLZ-Adressierung","extern","Ja","Nein"]
[4692,"Niederthalheim","O","PLZ-Adressierung","extern","Ja","Nein"]
[4693,"Desselbrunn","O","PLZ-Adressierung","extern","Ja","Nein"]
[4694,"Ohlsdorf","O","PLZ-Adressierung","extern","Ja","Ja"]
[4701,"Bad Schallerbach","O","PLZ-Adressierung","extern","Ja","Ja"]
[4702,"Wallern an der Trattnach","O","PLZ-Adressierung","extern","Ja","Nein"]
[4707,"Schlüßlberg","O","PLZ-Adressierung","extern","Ja","Nein"]
[4710,"Grieskirchen","O","PLZ-Adressierung","extern","Ja","Ja"]
[4712,"Michaelnbach","O","PLZ-Adressierung","extern","Ja","Nein"]
[4713,"Gallspach","O","PLZ-Adressierung","extern","Ja","Ja"]
[4714,"Meggenhofen","O","PLZ-Adressierung","extern","Ja","Nein"]
[4715,"Taufkirchen an der Trattnach","O","PLZ-Adressierung","extern","Ja","Nein"]
[4716,"Hofkirchen an der Trattnach","O","PLZ-Adressierung","extern","Ja","Nein"]
[4720,"Neumarkt im Hausruckkreis","O","PLZ-Adressierung","extern","Ja","Ja"]
[4721,"Altschwendt","O","PLZ-Adressierung","extern","Ja","Nein"]
[4722,"Peuerbach","O","PLZ-Adressierung","extern","Ja","Ja"]
[4723,"Natternbach","O","PLZ-Adressierung","extern","Ja","Nein"]
[4724,"Neukirchen am Walde","O","PLZ-Adressierung","extern","Ja","Ja"]
[4725,"St. Aegidi","O","PLZ-Adressierung","extern","Ja","Nein"]
[4730,"Waizenkirchen","O","PLZ-Adressierung","extern","Ja","Ja"]
[4731,"Prambachkirchen","O","PLZ-Adressierung","extern","Ja","Ja"]
[4732,"St. Thomas","O","PLZ-Adressierung","extern","Ja","Nein"]
[4733,"Heiligenberg","O","PLZ-Adressierung","extern","Ja","Nein"]
[4741,"Wendling","O","PLZ-Adressierung","extern","Ja","Nein"]
[4742,"Pram","O","PLZ-Adressierung","extern","Ja","Nein"]
[4743,"Peterskirchen","O","PLZ-Adressierung","extern","Ja","Nein"]
[4751,"Dorf","O","PLZ-Adressierung","extern","Ja","Nein"]
[4752,"Riedau","O","PLZ-Adressierung","extern","Ja","Ja"]
[4753,"Taiskirchen im Innkreis","O","PLZ-Adressierung","extern","Ja","Ja"]
[4754,"Andrichsfurt","O","PLZ-Adressierung","extern","Ja","Nein"]
[4755,"Zell an der Pram","O","PLZ-Adressierung","extern","Ja","Nein"]
[4760,"Raab","O","PLZ-Adressierung","extern","Ja","Ja"]
[4761,"Enzenkirchen","O","PLZ-Adressierung","extern","Ja","Nein"]
[4762,"St. Willibald","O","PLZ-Adressierung","extern","Ja","Nein"]
[4770,"Andorf","O","PLZ-Adressierung","extern","Ja","Ja"]
[4771,"Sigharting","O","PLZ-Adressierung","extern","Ja","Nein"]
[4772,"Lambrechten","O","PLZ-Adressierung","extern","Ja","Nein"]
[4773,"Eggerding","O","PLZ-Adressierung","extern","Ja","Nein"]
[4774,"St. Marienkirchen bei Schärding","O","PLZ-Adressierung","extern","Ja","Nein"]
[4775,"Taufkirchen an der Pram","O","PLZ-Adressierung","extern","Ja","Ja"]
[4776,"Diersbach","O","PLZ-Adressierung","extern","Ja","Nein"]
[4777,"Mayrhof","O","PLZ-Adressierung","extern","Ja","Nein"]
[4780,"Schärding","O","PLZ-Adressierung","extern","Ja","Ja"]
[4782,"St. Florian am Inn","O","PLZ-Adressierung","extern","Ja","Nein"]
[4783,"Wernstein am Inn","O","PLZ-Adressierung","extern","Ja","Nein"]
[4784,"Schardenberg","O","PLZ-Adressierung","extern","Ja","Ja"]
[4785,"Freinberg","O","PLZ-Adressierung","extern","Ja","Nein"]
[4786,"Brunnenthal","O","PLZ-Adressierung","extern","Ja","Nein"]
[4791,"Rainbach im Innkreis","O","PLZ-Adressierung","extern","Ja","Ja"]
[4792,"Münzkirchen","O","PLZ-Adressierung","extern","Ja","Ja"]
[4793,"St. Roman","O","PLZ-Adressierung","extern","Ja","Nein"]
[4794,"Kopfing im Innkreis","O","PLZ-Adressierung","extern","Ja","Nein"]
[4800,"Attnang-Puchheim","O","PLZ-Adressierung","extern","Ja","Ja"]
[4801,"Traunkirchen","O","PLZ-Adressierung","extern","Ja","Nein"]
[4802,"Ebensee","O","PLZ-Adressierung","extern","Ja","Ja"]
[4810,"Gmunden","O","PLZ-Adressierung","extern","Ja","Ja"]
[4812,"Pinsdorf","O","PLZ-Adressierung","extern","Ja","Ja"]
[4813,"Altmünster","O","PLZ-Adressierung","extern","Ja","Ja"]
[4814,"Neukirchen","O","PLZ-Adressierung","extern","Ja","Ja"]
[4815,"Ort bei Gmunden","O","PLZ-Postfach","extern","Nein","Ja"]
[4816,"Gschwandt","O","PLZ-Adressierung","extern","Ja","Ja"]
[4817,"St. Konrad","O","PLZ-Adressierung","extern","Ja","Nein"]
[4819,"Gmunden","O","PLZ-Postfach","extern","Nein","Ja"]
[4820,"Bad Ischl","O","PLZ-Adressierung","extern","Ja","Ja"]
[4821,"Lauffen","O","PLZ-Adressierung","extern","Ja","Nein"]
[4822,"Bad Goisern","O","PLZ-Adressierung","extern","Ja","Ja"]
[4823,"Steeg","O","PLZ-Adressierung","extern","Ja","Nein"]
[4824,"Gosau","O","PLZ-Adressierung","extern","Ja","Ja"]
[4825,"Gosau-Hintertal","O","PLZ-Adressierung","extern","Ja","Nein"]
[4829,"Bad Ischl","O","PLZ-Postfach","extern","Nein","Ja"]
[4830,"Hallstatt","O","PLZ-Adressierung","extern","Ja","Nein"]
[4831,"Obertraun","O","PLZ-Adressierung","extern","Ja","Nein"]
[4840,"Vöcklabruck","O","PLZ-Adressierung","extern","Ja","Ja"]
[4841,"Ungenach","O","PLZ-Adressierung","extern","Ja","Nein"]
[4842,"Zell am Pettenfirst","O","PLZ-Adressierung","extern","Ja","Nein"]
[4843,"Ampflwang","O","PLZ-Adressierung","extern","Ja","Ja"]
[4844,"Regau","O","PLZ-Adressierung","extern","Ja","Ja"]
[4845,"Rutzenmoos","O","PLZ-Adressierung","extern","Ja","Nein"]
[4850,"Timelkam","O","PLZ-Adressierung","extern","Ja","Ja"]
[4851,"Gampern","O","PLZ-Adressierung","extern","Ja","Nein"]
[4852,"Weyregg am Attersee","O","PLZ-Adressierung","extern","Ja","Nein"]
[4853,"Steinbach am Attersee","O","PLZ-Adressierung","extern","Ja","Ja"]
[4854,"Weißenbach","O","PLZ-Adressierung","extern","Ja","Nein"]
[4860,"Lenzing","O","PLZ-Adressierung","extern","Ja","Ja"]
[4861,"Schörfling","O","PLZ-Adressierung","extern","Ja","Ja"]
[4863,"Seewalchen am Attersee","O","PLZ-Adressierung","extern","Ja","Ja"]
[4864,"Attersee","O","PLZ-Adressierung","extern","Ja","Nein"]
[4865,"Nußdorf am Attersee","O","PLZ-Adressierung","extern","Ja","Ja"]
[4866,"Unterach","O","PLZ-Adressierung","extern","Ja","Ja"]
[4870,"Vöcklamarkt","O","PLZ-Adressierung","extern","Ja","Ja"]
[4871,"Zipf","O","PLZ-Adressierung","extern","Ja","Ja"]
[4872,"Neukirchen an der Vöckla","O","PLZ-Adressierung","extern","Ja","Nein"]
[4873,"Frankenburg am Hausruck","O","PLZ-Adressierung","extern","Ja","Ja"]
[4874,"Pramet","O","PLZ-Historisch","intern","Nein","Nein"]
[4880,"St. Georgen im Attergau","O","PLZ-Adressierung","extern","Ja","Ja"]
[4881,"Straß im Attergau","O","PLZ-Adressierung","extern","Ja","Nein"]
[4882,"Oberwang","O","PLZ-Adressierung","extern","Ja","Nein"]
[4890,"Frankenmarkt","O","PLZ-Adressierung","extern","Ja","Ja"]
[4891,"Pöndorf","O","PLZ-Adressierung","extern","Ja","Nein"]
[4892,"Fornach","O","PLZ-Adressierung","extern","Ja","Nein"]
[4893,"Zell am Moos","O","PLZ-Adressierung","extern","Ja","Ja"]
[4894,"Oberhofen am Irrsee","O","PLZ-Adressierung","extern","Ja","Ja"]
[4901,"Ottnang","O","PLZ-Adressierung","extern","Ja","Ja"]
[4902,"Wolfsegg am Hausruck","O","PLZ-Adressierung","extern","Ja","Nein"]
[4904,"Atzbach","O","PLZ-Adressierung","extern","Ja","Nein"]
[4905,"Thomasroith","O","PLZ-Adressierung","extern","Ja","Nein"]
[4906,"Eberschwang","O","PLZ-Adressierung","extern","Ja","Ja"]
[4910,"Ried im Innkreis","O","PLZ-Adressierung","extern","Ja","Ja"]
[4912,"Neuhofen im Innkreis","O","PLZ-Adressierung","extern","Ja","Nein"]
[4920,"Schildorn","O","PLZ-Adressierung","extern","Ja","Nein"]
[4921,"Hohenzell","O","PLZ-Adressierung","extern","Ja","Nein"]
[4922,"Geiersberg","O","PLZ-Adressierung","extern","Ja","Nein"]
[4923,"Lohnsburg","O","PLZ-Adressierung","extern","Ja","Ja"]
[4924,"Waldzell","O","PLZ-Adressierung","extern","Ja","Ja"]
[4925,"Pramet","O","PLZ-Adressierung","extern","Ja","Nein"]
[4926,"St. Marienkirchen am Hausruck","O","PLZ-Adressierung","extern","Ja","Nein"]
[4931,"Mettmach","O","PLZ-Adressierung","extern","Ja","Ja"]
[4932,"Kirchheim im Innkreis","O","PLZ-Adressierung","extern","Ja","Nein"]
[4933,"Wildenau","O","PLZ-Adressierung","extern","Ja","Nein"]
[4941,"Mehrnbach","O","PLZ-Adressierung","extern","Ja","Nein"]
[4942,"Gurten","O","PLZ-Adressierung","extern","Ja","Nein"]
[4943,"Geinberg","O","PLZ-Adressierung","extern","Ja","Ja"]
[4950,"Altheim","O","PLZ-Adressierung","extern","Ja","Ja"]
[4951,"Polling im Innkreis","O","PLZ-Adressierung","extern","Ja","Nein"]
[4952,"Weng im Innkreis","O","PLZ-Adressierung","extern","Ja","Nein"]
[4961,"Mühlheim am Inn","O","PLZ-Adressierung","extern","Ja","Nein"]
[4962,"Mining","O","PLZ-Adressierung","extern","Ja","Nein"]
[4963,"St. Peter am Hart","O","PLZ-Adressierung","extern","Ja","Nein"]
[4970,"Eitzing","O","PLZ-Adressierung","extern","Ja","Nein"]
[4971,"Aurolzmünster","O","PLZ-Adressierung","extern","Ja","Ja"]
[4972,"Utzenaich","O","PLZ-Adressierung","extern","Ja","Nein"]
[4973,"St. Martin","O","PLZ-Adressierung","extern","Ja","Ja"]
[4974,"Ort im Innkreis","O","PLZ-Adressierung","extern","Ja","Nein"]
[4975,"Suben","O","PLZ-Adressierung","extern","Ja","Nein"]
[4980,"Antiesenhofen","O","PLZ-Adressierung","extern","Ja","Nein"]
[4981,"Reichersberg","O","PLZ-Adressierung","extern","Ja","Nein"]
[4982,"Obernberg am Inn","O","PLZ-Adressierung","extern","Ja","Ja"]
[4983,"St. Georgen bei Obernberg am Inn","O","PLZ-Adressierung","extern","Ja","Nein"]
[4984,"Weilbach","O","PLZ-Adressierung","extern","Ja","Nein"]
[5010,"Salzburg","Sa","PLZ-Postfach","extern","Nein","Ja"]
[5012,"Salzburg","Sa","PLZ-Postfach","extern","Nein","Ja"]
[5013,"Salzburg-Liefering","Sa","PLZ-Postfach","extern","Nein","Ja"]
[5014,"Salzburg","Sa","PLZ-Postfach","extern","Nein","Ja"]
[5015,"Salzburg","Sa","PLZ-Postfach","extern","Nein","Ja"]
[5016,"Salzburg","Sa","PLZ-Postfach","extern","Nein","Ja"]
[5017,"Salzburg","Sa","PLZ-Postfach","extern","Nein","Ja"]
[5018,"Salzburg-Europark","Sa","PLZ-Postfach","extern","Nein","Ja"]
[5020,"Salzburg","Sa","PLZ-Adressierung","extern","Ja","Ja"]
[5021,"Salzburg Postfach","Sa","PLZ-Postfach","extern","Nein","Ja"]
[5022,"Salzburg","Sa","PLZ-Postfach","extern","Nein","Ja"]
[5023,"Salzburg-Gnigl","Sa","PLZ-Adressierung","extern","Ja","Ja"]
[5024,"Salzburg","Sa","PLZ-Postfach","extern","Nein","Ja"]
[5025,"Salzburg-Parsch","Sa","PLZ-Postfach","extern","Nein","Ja"]
[5026,"Salzburg-Aigen","Sa","PLZ-Adressierung","extern","Ja","Ja"]
[5027,"Salzburg","Sa","PLZ-Postfach","extern","Nein","Ja"]
[5028,"Salzburg-Kasern","Sa","PLZ-Postfach","extern","Nein","Ja"]
[5029,"Salzburg","Sa","PLZ-Postfach","extern","Nein","Ja"]
[5033,"Salzburg","Sa","PLZ-Postfach","extern","Nein","Ja"]
[5034,"Salzburg-Morzg","Sa","PLZ-Postfach","extern","Nein","Ja"]
[5061,"Elsbethen-Glasenbach","Sa","PLZ-Adressierung","extern","Ja","Ja"]
[5071,"Wals","Sa","PLZ-Adressierung","extern","Ja","Ja"]
[5072,"Siezenheim","Sa","PLZ-Postfach","extern","Nein","Ja"]
[5073,"Wals-Himmelreich","Sa","PLZ-Postfach","extern","Nein","Ja"]
[5081,"Anif","Sa","PLZ-Adressierung","extern","Ja","Ja"]
[5082,"Grödig","Sa","PLZ-Adressierung","extern","Ja","Ja"]
[5083,"Gartenau-St. Leonhard","Sa","PLZ-Adressierung","extern","Ja","Ja"]
[5084,"Großgmain","Sa","PLZ-Adressierung","extern","Ja","Ja"]
[5089,"Niederalm","Sa","PLZ-Postfach","extern","Nein","Ja"]
[5090,"Lofer","Sa","PLZ-Adressierung","extern","Ja","Ja"]
[5091,"Unken","Sa","PLZ-Adressierung","extern","Ja","Ja"]
[5092,"St. Martin bei Lofer","Sa","PLZ-Adressierung","extern","Ja","Nein"]
[5093,"Weißbach bei Lofer","Sa","PLZ-Adressierung","extern","Ja","Nein"]
[5101,"Bergheim","Sa","PLZ-Adressierung","extern","Ja","Ja"]
[5102,"Anthering","Sa","PLZ-Adressierung","extern","Ja","Ja"]
[5110,"Oberndorf bei Salzburg","Sa","PLZ-Adressierung","extern","Ja","Ja"]
[5111,"Bürmoos","Sa","PLZ-Adressierung","extern","Ja","Ja"]
[5112,"Lamprechtshausen","Sa","PLZ-Adressierung","extern","Ja","Ja"]
[5113,"St. Georgen bei Salzburg","Sa","PLZ-Adressierung","extern","Ja","Nein"]
[5114,"Göming","Sa","PLZ-Adressierung","extern","Ja","Nein"]
[5120,"St. Pantaleon","O","PLZ-Adressierung","extern","Ja","Nein"]
[5121,"Ostermiething","O","PLZ-Adressierung","extern","Ja","Ja"]
[5122,"Ach","O","PLZ-Adressierung","extern","Ja","Ja"]
[5131,"Franking","O","PLZ-Adressierung","extern","Ja","Nein"]
[5132,"Geretsberg","O","PLZ-Adressierung","extern","Ja","Nein"]
[5133,"Gilgenberg am Weilhart","O","PLZ-Adressierung","extern","Ja","Nein"]
[5134,"Schwand im Innkreis","O","PLZ-Adressierung","extern","Ja","Nein"]
[5141,"Moosdorf","O","PLZ-Adressierung","extern","Ja","Nein"]
[5142,"Eggelsberg","O","PLZ-Adressierung","extern","Ja","Ja"]
[5143,"Feldkirchen bei Mattighofen","O","PLZ-Adressierung","extern","Ja","Nein"]
[5144,"Handenberg","O","PLZ-Adressierung","extern","Ja","Nein"]
[5145,"Neukirchen an der Enknach","O","PLZ-Adressierung","extern","Ja","Ja"]
[5151,"Nußdorf am Haunsberg","Sa","PLZ-Adressierung","extern","Ja","Nein"]
[5152,"Michaelbeuern","Sa","PLZ-Adressierung","extern","Ja","Nein"]
[5161,"Elixhausen","Sa","PLZ-Adressierung","extern","Ja","Ja"]
[5162,"Obertrum am See","Sa","PLZ-Adressierung","extern","Ja","Ja"]
[5163,"Mattsee","Sa","PLZ-Adressierung","extern","Ja","Ja"]
[5164,"Seeham","Sa","PLZ-Adressierung","extern","Ja","Nein"]
[5165,"Berndorf bei Salzburg","Sa","PLZ-Adressierung","extern","Ja","Ja"]
[5201,"Seekirchen","Sa","PLZ-Adressierung","extern","Ja","Ja"]
[5202,"Neumarkt am Wallersee","Sa","PLZ-Adressierung","extern","Ja","Ja"]
[5203,"Köstendorf","Sa","PLZ-Adressierung","extern","Ja","Nein"]
[5204,"Straßwalchen","Sa","PLZ-Adressierung","extern","Ja","Ja"]
[5205,"Schleedorf","Sa","PLZ-Adressierung","extern","Ja","Nein"]
[5211,"Friedburg","O","PLZ-Adressierung","extern","Ja","Ja"]
[5212,"Schneegattern","O","PLZ-Adressierung","extern","Ja","Nein"]
[5221,"Lochen","O","PLZ-Adressierung","extern","Ja","Ja"]
[5222,"Munderfing","O","PLZ-Adressierung","extern","Ja","Ja"]
[5223,"Pfaffstätt","O","PLZ-Adressierung","extern","Ja","Nein"]
[5224,"Auerbach","O","PLZ-Adressierung","extern","Ja","Nein"]
[5225,"Jeging","O","PLZ-Adressierung","extern","Ja","Nein"]
[5230,"Mattighofen","O","PLZ-Adressierung","extern","Ja","Ja"]
[5231,"Schalchen","O","PLZ-Adressierung","extern","Ja","Nein"]
[5232,"Kirchberg bei Mattighofen","O","PLZ-Adressierung","extern","Ja","Nein"]
[5233,"Pischelsdorf am Engelbach","O","PLZ-Adressierung","extern","Ja","Nein"]
[5241,"Maria Schmolln","O","PLZ-Adressierung","extern","Ja","Nein"]
[5242,"St. Johann am Walde","O","PLZ-Adressierung","extern","Ja","Nein"]
[5251,"Höhnhart","O","PLZ-Adressierung","extern","Ja","Ja"]
[5252,"Aspach","O","PLZ-Adressierung","extern","Ja","Ja"]
[5261,"Uttendorf","O","PLZ-Adressierung","extern","Ja","Ja"]
[5270,"Mauerkirchen","O","PLZ-Adressierung","extern","Ja","Ja"]
[5271,"Moosbach","O","PLZ-Adressierung","extern","Ja","Nein"]
[5272,"Treubach","O","PLZ-Adressierung","extern","Ja","Nein"]
[5273,"Roßbach","O","PLZ-Adressierung","extern","Ja","Nein"]
[5274,"Burgkirchen","O","PLZ-Adressierung","extern","Ja","Nein"]
[5280,"Braunau am Inn","O","PLZ-Adressierung","extern","Ja","Ja"]
[5282,"Braunau","O","PLZ-Adressierung","extern","Ja","Ja"]
[5300,"Hallwang","Sa","PLZ-Adressierung","extern","Ja","Ja"]
[5301,"Eugendorf","Sa","PLZ-Adressierung","extern","Ja","Ja"]
[5302,"Henndorf am Wallersee","Sa","PLZ-Adressierung","extern","Ja","Ja"]
[5303,"Thalgau","Sa","PLZ-Adressierung","extern","Ja","Ja"]
[5310,"Mondsee","O","PLZ-Adressierung","extern","Ja","Ja"]
[5311,"Loibichl","O","PLZ-Adressierung","extern","Ja","Nein"]
[5321,"Koppl","Sa","PLZ-Adressierung","extern","Ja","Nein"]
[5322,"Hof bei Salzburg","Sa","PLZ-Adressierung","extern","Ja","Ja"]
[5323,"Ebenau","Sa","PLZ-Adressierung","extern","Ja","Nein"]
[5324,"Faistenau","Sa","PLZ-Adressierung","extern","Ja","Ja"]
[5325,"Plainfeld","Sa","PLZ-Adressierung","extern","Ja","Nein"]
[5330,"Fuschl am See","Sa","PLZ-Adressierung","extern","Ja","Ja"]
[5340,"St. Gilgen","Sa","PLZ-Adressierung","extern","Ja","Ja"]
[5342,"Abersee","Sa","PLZ-Adressierung","extern","Ja","Nein"]
[5350,"Strobl","Sa","PLZ-Adressierung","extern","Ja","Ja"]
[5351,"Aigen-Voglhub","Sa","PLZ-Adressierung","extern","Ja","Nein"]
[5360,"St. Wolfgang im Salzkammergut","O","PLZ-Adressierung","extern","Ja","Ja"]
[5400,"Hallein","Sa","PLZ-Adressierung","extern","Ja","Ja"]
[5409,"Hallein","Sa","PLZ-Postfach","extern","Nein","Ja"]
[5411,"Oberalm","Sa","PLZ-Adressierung","extern","Ja","Ja"]
[5412,"Puch bei Hallein","Sa","PLZ-Adressierung","extern","Ja","Ja"]
[5421,"Adnet","Sa","PLZ-Adressierung","extern","Ja","Ja"]
[5422,"Heilbad Dürrnberg","Sa","PLZ-Adressierung","extern","Ja","Nein"]
[5423,"St. Koloman","Sa","PLZ-Adressierung","extern","Ja","Nein"]
[5424,"Bad Vigaun","Sa","PLZ-Adressierung","extern","Ja","Nein"]
[5431,"Kuchl","Sa","PLZ-Adressierung","extern","Ja","Ja"]
[5440,"Golling an der Salzach","Sa","PLZ-Adressierung","extern","Ja","Ja"]
[5441,"Abtenau","Sa","PLZ-Adressierung","extern","Ja","Ja"]
[5442,"Rußbach am Paß Gschütt","Sa","PLZ-Adressierung","extern","Ja","Nein"]
[5450,"Werfen","Sa","PLZ-Adressierung","extern","Ja","Ja"]
[5451,"Tenneck","Sa","PLZ-Adressierung","extern","Ja","Nein"]
[5452,"Pfarrwerfen","Sa","PLZ-Adressierung","extern","Ja","Ja"]
[5453,"Werfenweng","Sa","PLZ-Adressierung","extern","Ja","Nein"]
[5500,"Bischofshofen","Sa","PLZ-Adressierung","extern","Ja","Ja"]
[5505,"Mühlbach am Hochkönig","Sa","PLZ-Adressierung","extern","Ja","Ja"]
[5511,"Hüttau","Sa","PLZ-Adressierung","extern","Ja","Nein"]
[5521,"Niedernfritz","Sa","PLZ-Adressierung","extern","Ja","Nein"]
[5522,"St. Martin am Tennengebirge","Sa","PLZ-Adressierung","extern","Ja","Ja"]
[5523,"Lungötz","Sa","PLZ-Adressierung","extern","Ja","Nein"]
[5524,"Annaberg","Sa","PLZ-Adressierung","extern","Ja","Ja"]
[5531,"Eben im Pongau","Sa","PLZ-Adressierung","extern","Ja","Ja"]
[5532,"Filzmoos","Sa","PLZ-Adressierung","extern","Ja","Ja"]
[5541,"Altenmarkt im Pongau","Sa","PLZ-Adressierung","extern","Ja","Ja"]
[5542,"Flachau","Sa","PLZ-Adressierung","extern","Ja","Ja"]
[5550,"Radstadt","Sa","PLZ-Adressierung","extern","Ja","Ja"]
[5552,"Forstau","Sa","PLZ-Adressierung","extern","Ja","Nein"]
[5561,"Untertauern","Sa","PLZ-Adressierung","extern","Ja","Nein"]
[5562,"Obertauern","Sa","PLZ-Adressierung","extern","Ja","Ja"]
[5563,"Tweng","Sa","PLZ-Adressierung","extern","Ja","Nein"]
[5570,"Mauterndorf","Sa","PLZ-Adressierung","extern","Ja","Ja"]
[5571,"Mariapfarr","Sa","PLZ-Adressierung","extern","Ja","Ja"]
[5572,"St. Andrä im Lungau","Sa","PLZ-Adressierung","extern","Ja","Nein"]
[5573,"Weißpriach","Sa","PLZ-Adressierung","extern","Ja","Nein"]
[5580,"Tamsweg","Sa","PLZ-Adressierung","extern","Ja","Ja"]
[5581,"St. Margarethen im Lungau","Sa","PLZ-Adressierung","extern","Ja","Nein"]
[5582,"St. Michael im Lungau","Sa","PLZ-Adressierung","extern","Ja","Ja"]
[5583,"Muhr","Sa","PLZ-Adressierung","extern","Ja","Nein"]
[5584,"Zederhaus","Sa","PLZ-Adressierung","extern","Ja","Nein"]
[5585,"Unternberg","Sa","PLZ-Adressierung","extern","Ja","Nein"]
[5591,"Ramingstein","Sa","PLZ-Adressierung","extern","Ja","Nein"]
[5592,"Thomatal","Sa","PLZ-Adressierung","extern","Ja","Nein"]
[5600,"St. Johann im Pongau","Sa","PLZ-Adressierung","extern","Ja","Ja"]
[5602,"Wagrain","Sa","PLZ-Adressierung","extern","Ja","Ja"]
[5603,"Kleinarl","Sa","PLZ-Adressierung","extern","Ja","Nein"]
[5611,"Großarl","Sa","PLZ-Adressierung","extern","Ja","Ja"]
[5612,"Hüttschlag","Sa","PLZ-Adressierung","extern","Ja","Nein"]
[5620,"Schwarzach im Pongau","Sa","PLZ-Adressierung","extern","Ja","Ja"]
[5621,"St. Veit im Pongau","Sa","PLZ-Adressierung","extern","Ja","Nein"]
[5622,"Goldegg","Sa","PLZ-Adressierung","extern","Ja","Nein"]
[5623,"Schwarzach im Pongau","Sa","InteressentenPLZ","extern","Nein","Ja"]
[5630,"Bad Hofgastein","Sa","PLZ-Adressierung","extern","Ja","Ja"]
[5632,"Dorfgastein","Sa","PLZ-Adressierung","extern","Ja","Nein"]
[5640,"Bad Gastein","Sa","PLZ-Adressierung","extern","Ja","Ja"]
[5645,"Böckstein","Sa","PLZ-Adressierung","extern","Ja","Nein"]
[5651,"Lend","Sa","PLZ-Adressierung","extern","Ja","Nein"]
[5652,"Dienten am Hochkönig","Sa","PLZ-Adressierung","extern","Ja","Nein"]
[5660,"Taxenbach","Sa","PLZ-Adressierung","extern","Ja","Ja"]
[5661,"Rauris","Sa","PLZ-Adressierung","extern","Ja","Ja"]
[5662,"Gries","Sa","PLZ-Adressierung","extern","Ja","Nein"]
[5671,"Bruck an der Großglocknerstraße","Sa","PLZ-Adressierung","extern","Ja","Ja"]
[5672,"Fusch an der Glocknerstraße","Sa","PLZ-Adressierung","extern","Ja","Nein"]
[5700,"Zell am See","Sa","PLZ-Adressierung","extern","Ja","Ja"]
[5702,"Zell am See-Schüttdorf","Sa","PLZ-Postfach","extern","Nein","Ja"]
[5710,"Kaprun","Sa","PLZ-Adressierung","extern","Ja","Ja"]
[5721,"Piesendorf","Sa","PLZ-Adressierung","extern","Ja","Ja"]
[5722,"Niedernsill","Sa","PLZ-Adressierung","extern","Ja","Nein"]
[5723,"Uttendorf","Sa","PLZ-Adressierung","extern","Ja","Ja"]
[5724,"Stuhlfelden","Sa","PLZ-Adressierung","extern","Ja","Nein"]
[5730,"Mittersill","Sa","PLZ-Adressierung","extern","Ja","Ja"]
[5731,"Hollersbach im Pinzgau","Sa","PLZ-Adressierung","extern","Ja","Nein"]
[5732,"Mühlbach","Sa","PLZ-Adressierung","extern","Ja","Nein"]
[5733,"Bramberg am Wildkogel","Sa","PLZ-Adressierung","extern","Ja","Ja"]
[5741,"Neukirchen am Großvenediger","Sa","PLZ-Adressierung","extern","Ja","Ja"]
[5742,"Wald im Pinzgau","Sa","PLZ-Adressierung","extern","Ja","Ja"]
[5743,"Krimml","Sa","PLZ-Adressierung","extern","Ja","Ja"]
[5751,"Maishofen","Sa","PLZ-Adressierung","extern","Ja","Ja"]
[5752,"Viehhofen","Sa","PLZ-Adressierung","extern","Ja","Nein"]
[5753,"Saalbach","Sa","PLZ-Adressierung","extern","Ja","Ja"]
[5754,"Hinterglemm","Sa","PLZ-Adressierung","extern","Ja","Ja"]
[5760,"Saalfelden am Steinernen Meer","Sa","PLZ-Adressierung","extern","Ja","Ja"]
[5761,"Maria Alm am Steinernen Meer","Sa","PLZ-Adressierung","extern","Ja","Ja"]
[5771,"Leogang","Sa","PLZ-Adressierung","extern","Ja","Ja"]
[6010,"Innsbruck","T","PLZ-Postfach","extern","Nein","Ja"]
[6012,"Innsbruck","T","PLZ-Postfach","extern","Nein","Ja"]
[6013,"Innsbruck","T","PLZ-Postfach","extern","Nein","Ja"]
[6014,"Innsbruck","T","PLZ-Postfach","extern","Nein","Ja"]
[6020,"Innsbruck","T","PLZ-Adressierung","extern","Ja","Nein"]
[6021,"Innsbruck Postfach","T","PLZ-Postfach","extern","Nein","Ja"]
[6022,"Innsbruck","T","PLZ-Postfach","extern","Nein","Ja"]
[6023,"Innsbruck","T","PLZ-Postfach","extern","Nein","Ja"]
[6026,"Innsbruck","T","PLZ-Postfach","extern","Nein","Ja"]
[6027,"Innsbruck","T","PLZ-Postfach","extern","Nein","Ja"]
[6029,"Innsbruck","T","PLZ-Postfach","extern","Nein","Ja"]
[6033,"Innsbruck-Arzl","T","PLZ-Postfach","extern","Nein","Ja"]
[6040,"Innsbruck-Neuarzl","T","PLZ-Postfach","extern","Nein","Ja"]
[6050,"Hall in Tirol","T","PLZ-Postfach","extern","Nein","Ja"]
[6060,"Hall in Tirol","T","PLZ-Adressierung","extern","Ja","Ja"]
[6063,"Rum","T","PLZ-Adressierung","extern","Ja","Ja"]
[6064,"Rum","T","PLZ-Postfach","extern","Nein","Ja"]
[6065,"Thaur","T","PLZ-Adressierung","extern","Ja","Nein"]
[6067,"Absam","T","PLZ-Adressierung","extern","Ja","Ja"]
[6068,"Mils","T","PLZ-Adressierung","extern","Ja","Ja"]
[6069,"Gnadenwald","T","PLZ-Adressierung","extern","Ja","Nein"]
[6070,"Ampass","T","PLZ-Adressierung","extern","Ja","Nein"]
[6071,"Aldrans","T","PLZ-Adressierung","extern","Ja","Ja"]
[6072,"Lans","T","PLZ-Adressierung","extern","Ja","Nein"]
[6073,"Sistrans","T","PLZ-Adressierung","extern","Ja","Nein"]
[6074,"Rinn","T","PLZ-Adressierung","extern","Ja","Nein"]
[6075,"Tulfes","T","PLZ-Adressierung","extern","Ja","Nein"]
[6080,"Innsbruck-Igls","T","PLZ-Adressierung","extern","Ja","Ja"]
[6082,"Patsch","T","PLZ-Adressierung","extern","Ja","Nein"]
[6083,"Ellbögen","T","PLZ-Adressierung","extern","Ja","Nein"]
[6091,"Götzens","T","PLZ-Adressierung","extern","Ja","Ja"]
[6092,"Birgitz","T","PLZ-Adressierung","extern","Ja","Nein"]
[6094,"Axams","T","PLZ-Adressierung","extern","Ja","Ja"]
[6095,"Grinzens","T","PLZ-Adressierung","extern","Ja","Nein"]
[6100,"Seefeld in Tirol","T","PLZ-Adressierung","extern","Ja","Ja"]
[6103,"Reith bei Seefeld","T","PLZ-Adressierung","extern","Ja","Nein"]
[6105,"Leutasch","T","PLZ-Adressierung","extern","Ja","Nein"]
[6108,"Scharnitz","T","PLZ-Adressierung","extern","Ja","Nein"]
[6111,"Volders","T","PLZ-Adressierung","extern","Ja","Ja"]
[6112,"Wattens","T","PLZ-Adressierung","extern","Ja","Ja"]
[6113,"Wattenberg","T","PLZ-Adressierung","extern","Ja","Nein"]
[6114,"Kolsass","T","PLZ-Adressierung","extern","Ja","Ja"]
[6115,"Kolsassberg","T","PLZ-Adressierung","extern","Ja","Nein"]
[6121,"Baumkirchen","T","PLZ-Adressierung","extern","Ja","Nein"]
[6122,"Fritzens","T","PLZ-Adressierung","extern","Ja","Nein"]
[6123,"Terfens","T","PLZ-Adressierung","extern","Ja","Nein"]
[6130,"Schwaz","T","PLZ-Adressierung","extern","Ja","Ja"]
[6131,"Schwaz","T","PLZ-Postfach","extern","Nein","Ja"]
[6133,"Weerberg","T","PLZ-Adressierung","extern","Ja","Nein"]
[6134,"Vomp","T","PLZ-Adressierung","extern","Ja","Ja"]
[6135,"Stans","T","PLZ-Adressierung","extern","Ja","Ja"]
[6141,"Schönberg im Stubaital","T","PLZ-Adressierung","extern","Ja","Nein"]
[6142,"Mieders","T","PLZ-Adressierung","extern","Ja","Nein"]
[6143,"Matrei am Brenner","T","PLZ-Adressierung","extern","Ja","Ja"]
[6145,"Navis","T","PLZ-Adressierung","extern","Ja","Nein"]
[6150,"Steinach am Brenner","T","PLZ-Adressierung","extern","Ja","Ja"]
[6152,"Trins","T","PLZ-Adressierung","extern","Ja","Nein"]
[6154,"St. Jodok am Brenner","T","PLZ-Adressierung","extern","Ja","Nein"]
[6156,"Gries am Brenner","T","PLZ-Adressierung","extern","Ja","Nein"]
[6157,"Obernberg am Brenner","T","PLZ-Adressierung","extern","Ja","Nein"]
[6161,"Natters","T","PLZ-Adressierung","extern","Ja","Nein"]
[6162,"Mutters","T","PLZ-Adressierung","extern","Ja","Ja"]
[6165,"Telfes im Stubai","T","PLZ-Adressierung","extern","Ja","Nein"]
[6166,"Fulpmes","T","PLZ-Adressierung","extern","Ja","Ja"]
[6167,"Neustift im Stubaital","T","PLZ-Adressierung","extern","Ja","Ja"]
[6170,"Zirl","T","PLZ-Adressierung","extern","Ja","Ja"]
[6173,"Oberperfuss","T","PLZ-Adressierung","extern","Ja","Ja"]
[6175,"Kematen in Tirol","T","PLZ-Adressierung","extern","Ja","Ja"]
[6176,"Völs","T","PLZ-Adressierung","extern","Ja","Ja"]
[6177,"Völs","T","PLZ-Postfach","extern","Nein","Ja"]
[6178,"Unterperfuss","T","PLZ-Adressierung","extern","Ja","Nein"]
[6179,"Ranggen","T","PLZ-Adressierung","extern","Ja","Nein"]
[6181,"Sellrain","T","PLZ-Adressierung","extern","Ja","Ja"]
[6182,"Gries im Sellrain","T","PLZ-Adressierung","extern","Ja","Ja"]
[6183,"Kühtai","T","PLZ-Adressierung","extern","Ja","Nein"]
[6184,"St. Sigmund","T","PLZ-Adressierung","extern","Ja","Nein"]
[6200,"Jenbach","T","PLZ-Adressierung","extern","Ja","Ja"]
[6210,"Wiesing","T","PLZ-Adressierung","extern","Ja","Nein"]
[6212,"Maurach","T","PLZ-Adressierung","extern","Ja","Ja"]
[6213,"Pertisau","T","PLZ-Adressierung","extern","Ja","Nein"]
[6215,"Achenkirch","T","PLZ-Adressierung","extern","Ja","Ja"]
[6222,"Gallzein","T","PLZ-Adressierung","extern","Ja","Nein"]
[6230,"Brixlegg","T","PLZ-Adressierung","extern","Ja","Ja"]
[6232,"Münster","T","PLZ-Adressierung","extern","Ja","Ja"]
[6233,"Kramsach","T","PLZ-Adressierung","extern","Ja","Ja"]
[6234,"Brandenberg","T","PLZ-Adressierung","extern","Ja","Nein"]
[6235,"Reith im Alpbachtal","T","PLZ-Adressierung","extern","Ja","Nein"]
[6236,"Alpbach","T","PLZ-Adressierung","extern","Ja","Ja"]
[6240,"Rattenberg","T","PLZ-Adressierung","extern","Ja","Ja"]
[6250,"Kundl","T","PLZ-Adressierung","extern","Ja","Ja"]
[6252,"Breitenbach am Inn","T","PLZ-Adressierung","extern","Ja","Nein"]
[6260,"Bruck am Ziller","T","PLZ-Adressierung","extern","Ja","Nein"]
[6261,"Strass im Zillertal","T","PLZ-Adressierung","extern","Ja","Nein"]
[6262,"Schlitters","T","PLZ-Adressierung","extern","Ja","Ja"]
[6263,"Fügen","T","PLZ-Adressierung","extern","Ja","Ja"]
[6265,"Hart im Zillertal","T","PLZ-Adressierung","extern","Ja","Nein"]
[6271,"Uderns","T","PLZ-Adressierung","extern","Ja","Ja"]
[6272,"Kaltenbach","T","PLZ-Adressierung","extern","Ja","Ja"]
[6274,"Aschau","T","PLZ-Adressierung","extern","Ja","Ja"]
[6275,"Stumm","T","PLZ-Adressierung","extern","Ja","Nein"]
[6276,"Stummerberg","T","PLZ-Adressierung","extern","Ja","Nein"]
[6280,"Zell am Ziller","T","PLZ-Adressierung","extern","Ja","Ja"]
[6281,"Gerlos","T","PLZ-Adressierung","extern","Ja","Ja"]
[6283,"Hippach","T","PLZ-Adressierung","extern","Ja","Ja"]
[6284,"Ramsau im Zillertal","T","PLZ-Adressierung","extern","Ja","Nein"]
[6290,"Mayrhofen","T","PLZ-Adressierung","extern","Ja","Ja"]
[6292,"Finkenberg","T","PLZ-Adressierung","extern","Ja","Nein"]
[6293,"Tux","T","PLZ-Adressierung","extern","Ja","Ja"]
[6294,"Hintertux","T","PLZ-Adressierung","extern","Ja","Nein"]
[6295,"Ginzling","T","PLZ-Adressierung","extern","Ja","Nein"]
[6300,"Wörgl","T","PLZ-Adressierung","extern","Ja","Ja"]
[6302,"Wörgl","T","PLZ-Postfach","extern","Nein","Ja"]
[6305,"Itter","T","PLZ-Adressierung","extern","Ja","Nein"]
[6306,"Söll","T","PLZ-Adressierung","extern","Ja","Ja"]
[6311,"Wildschönau-Oberau","T","PLZ-Adressierung","extern","Ja","Ja"]
[6313,"Wildschönau-Auffach","T","PLZ-Adressierung","extern","Ja","Nein"]
[6314,"Wildschönau-Niederau","T","PLZ-Adressierung","extern","Ja","Nein"]
[6320,"Angerberg","T","PLZ-Adressierung","extern","Ja","Nein"]
[6322,"Kirchbichl","T","PLZ-Adressierung","extern","Ja","Ja"]
[6323,"Bad Häring","T","PLZ-Adressierung","extern","Ja","Ja"]
[6324,"Mariastein","T","PLZ-Adressierung","extern","Ja","Nein"]
[6330,"Kufstein","T","PLZ-Adressierung","extern","Ja","Ja"]
[6332,"Kufstein","T","PLZ-Postfach","extern","Nein","Ja"]
[6333,"Kufstein","T","PLZ-Postfach","extern","Nein","Ja"]
[6334,"Schwoich","T","PLZ-Adressierung","extern","Ja","Nein"]
[6335,"Thiersee","T","PLZ-Adressierung","extern","Ja","Ja"]
[6336,"Langkampfen","T","PLZ-Adressierung","extern","Ja","Nein"]
[6341,"Ebbs","T","PLZ-Adressierung","extern","Ja","Ja"]
[6342,"Niederndorf","T","PLZ-Adressierung","extern","Ja","Ja"]
[6343,"Erl","T","PLZ-Adressierung","extern","Ja","Nein"]
[6344,"Walchsee","T","PLZ-Adressierung","extern","Ja","Ja"]
[6345,"Kössen","T","PLZ-Adressierung","extern","Ja","Ja"]
[6351,"Scheffau am Wilden Kaiser","T","PLZ-Adressierung","extern","Ja","Ja"]
[6352,"Ellmau","T","PLZ-Adressierung","extern","Ja","Ja"]
[6353,"Going am Wilden Kaiser","T","PLZ-Adressierung","extern","Ja","Ja"]
[6361,"Hopfgarten","T","PLZ-Adressierung","extern","Ja","Ja"]
[6363,"Westendorf","T","PLZ-Adressierung","extern","Ja","Ja"]
[6364,"Brixen im Thale","T","PLZ-Adressierung","extern","Ja","Ja"]
[6365,"Kirchberg in Tirol","T","PLZ-Adressierung","extern","Ja","Ja"]
[6370,"Kitzbühel","T","PLZ-Adressierung","extern","Ja","Ja"]
[6372,"Oberndorf in Tirol","T","PLZ-Adressierung","extern","Ja","Ja"]
[6373,"Jochberg","T","PLZ-Adressierung","extern","Ja","Nein"]
[6380,"St. Johann in Tirol","T","PLZ-Adressierung","extern","Ja","Ja"]
[6382,"Kirchdorf in Tirol","T","PLZ-Adressierung","extern","Ja","Nein"]
[6383,"Erpfendorf","T","PLZ-Adressierung","extern","Ja","Ja"]
[6384,"Waidring","T","PLZ-Adressierung","extern","Ja","Ja"]
[6385,"Schwendt","T","PLZ-Adressierung","extern","Ja","Nein"]
[6391,"Fieberbrunn","T","PLZ-Adressierung","extern","Ja","Ja"]
[6392,"St. Jakob in Haus","T","PLZ-Adressierung","extern","Ja","Nein"]
[6393,"St. Ulrich am Pillersee","T","PLZ-Adressierung","extern","Ja","Ja"]
[6395,"Hochfilzen","T","PLZ-Adressierung","extern","Ja","Nein"]
[6401,"Inzing","T","PLZ-Adressierung","extern","Ja","Ja"]
[6402,"Hatting","T","PLZ-Adressierung","extern","Ja","Nein"]
[6403,"Flaurling","T","PLZ-Adressierung","extern","Ja","Nein"]
[6404,"Polling","T","PLZ-Adressierung","extern","Ja","Nein"]
[6405,"Pfaffenhofen","T","PLZ-Adressierung","extern","Ja","Nein"]
[6406,"Oberhofen im Inntal","T","PLZ-Adressierung","extern","Ja","Nein"]
[6408,"Pettnau","T","PLZ-Adressierung","extern","Ja","Nein"]
[6410,"Telfs","T","PLZ-Adressierung","extern","Ja","Ja"]
[6412,"Telfs-St. Georgen","T","PLZ-Postfach","extern","Nein","Ja"]
[6414,"Mieming","T","PLZ-Adressierung","extern","Ja","Ja"]
[6416,"Obsteig","T","PLZ-Adressierung","extern","Ja","Nein"]
[6421,"Rietz","T","PLZ-Adressierung","extern","Ja","Nein"]
[6422,"Stams","T","PLZ-Adressierung","extern","Ja","Ja"]
[6423,"Mötz","T","PLZ-Adressierung","extern","Ja","Nein"]
[6424,"Silz","T","PLZ-Adressierung","extern","Ja","Ja"]
[6425,"Haiming","T","PLZ-Adressierung","extern","Ja","Ja"]
[6426,"Roppen","T","PLZ-Adressierung","extern","Ja","Nein"]
[6430,"Ötztal Bahnhof","T","PLZ-Adressierung","extern","Ja","Ja"]
[6432,"Sautens","T","PLZ-Adressierung","extern","Ja","Nein"]
[6433,"Oetz","T","PLZ-Adressierung","extern","Ja","Ja"]
[6441,"Umhausen","T","PLZ-Adressierung","extern","Ja","Ja"]
[6444,"Längenfeld","T","PLZ-Adressierung","extern","Ja","Ja"]
[6450,"Sölden","T","PLZ-Adressierung","extern","Ja","Ja"]
[6452,"Hochsölden","T","PLZ-Adressierung","extern","Ja","Nein"]
[6456,"Obergurgl","T","PLZ-Adressierung","extern","Ja","Ja"]
[6458,"Vent","T","PLZ-Adressierung","extern","Ja","Nein"]
[6460,"Imst","T","PLZ-Adressierung","extern","Ja","Ja"]
[6462,"Karres","T","PLZ-Adressierung","extern","Ja","Nein"]
[6464,"Tarrenz","T","PLZ-Adressierung","extern","Ja","Nein"]
[6465,"Nassereith","T","PLZ-Adressierung","extern","Ja","Ja"]
[6471,"Arzl im Pitztal","T","PLZ-Adressierung","extern","Ja","Ja"]
[6473,"Wenns","T","PLZ-Adressierung","extern","Ja","Ja"]
[6474,"Jerzens","T","PLZ-Adressierung","extern","Ja","Nein"]
[6481,"St. Leonhard im Pitztal","T","PLZ-Adressierung","extern","Ja","Ja"]
[6491,"Schönwies","T","PLZ-Adressierung","extern","Ja","Nein"]
[6492,"Imsterberg","T","PLZ-Adressierung","extern","Ja","Nein"]
[6500,"Landeck","T","PLZ-Adressierung","extern","Ja","Ja"]
[6503,"Landeck-Öd","T","PLZ-Postfach","extern","Nein","Ja"]
[6511,"Zams","T","PLZ-Adressierung","extern","Ja","Ja"]
[6521,"Fließ","T","PLZ-Adressierung","extern","Ja","Nein"]
[6522,"Prutz","T","PLZ-Adressierung","extern","Ja","Ja"]
[6524,"Feichten im Kaunertal","T","PLZ-Adressierung","extern","Ja","Nein"]
[6527,"Kaunerberg","T","PLZ-Adressierung","extern","Ja","Nein"]
[6528,"Fendels","T","PLZ-Adressierung","extern","Ja","Nein"]
[6531,"Ried im Oberinntal","T","PLZ-Adressierung","extern","Ja","Ja"]
[6532,"Ladis","T","PLZ-Adressierung","extern","Ja","Nein"]
[6533,"Fiss","T","PLZ-Adressierung","extern","Ja","Ja"]
[6534,"Serfaus","T","PLZ-Adressierung","extern","Ja","Ja"]
[6541,"Tösens","T","PLZ-Adressierung","extern","Ja","Nein"]
[6542,"Pfunds","T","PLZ-Adressierung","extern","Ja","Ja"]
[6543,"Nauders","T","PLZ-Adressierung","extern","Ja","Ja"]
[6544,"Spiss","T","PLZ-Adressierung","extern","Ja","Nein"]
[6551,"Pians","T","PLZ-Adressierung","extern","Ja","Ja"]
[6552,"Tobadill","T","PLZ-Adressierung","extern","Ja","Nein"]
[6553,"See","T","PLZ-Adressierung","extern","Ja","Ja"]
[6555,"Kappl","T","PLZ-Adressierung","extern","Ja","Ja"]
[6561,"Ischgl","T","PLZ-Adressierung","extern","Ja","Ja"]
[6562,"Mathon","T","PLZ-Adressierung","extern","Ja","Nein"]
[6563,"Galtür","T","PLZ-Adressierung","extern","Ja","Ja"]
[6571,"Strengen","T","PLZ-Adressierung","extern","Ja","Nein"]
[6572,"Flirsch","T","PLZ-Adressierung","extern","Ja","Ja"]
[6574,"Pettneu am Arlberg","T","PLZ-Adressierung","extern","Ja","Ja"]
[6580,"St. Anton am Arlberg","T","PLZ-Adressierung","extern","Ja","Ja"]
[6591,"Grins","T","PLZ-Adressierung","extern","Ja","Nein"]
[6600,"Reutte","T","PLZ-Adressierung","extern","Ja","Ja"]
[6610,"Wängle","T","PLZ-Adressierung","extern","Ja","Nein"]
[6611,"Heiterwang","T","PLZ-Adressierung","extern","Ja","Nein"]
[6621,"Bichlbach","T","PLZ-Adressierung","extern","Ja","Ja"]
[6622,"Berwang","T","PLZ-Adressierung","extern","Ja","Nein"]
[6623,"Namlos","T","PLZ-Adressierung","extern","Ja","Nein"]
[6631,"Lermoos","T","PLZ-Adressierung","extern","Ja","Ja"]
[6632,"Ehrwald","T","PLZ-Adressierung","extern","Ja","Ja"]
[6633,"Biberwier","T","PLZ-Adressierung","extern","Ja","Nein"]
[6642,"Stanzach","T","PLZ-Adressierung","extern","Ja","Nein"]
[6644,"Elmen","T","PLZ-Adressierung","extern","Ja","Nein"]
[6645,"Vorderhornbach","T","PLZ-Adressierung","extern","Ja","Nein"]
[6646,"Hinterhornbach","T","PLZ-Adressierung","extern","Ja","Nein"]
[6647,"Pfafflar","T","PLZ-Adressierung","extern","Ja","Nein"]
[6650,"Gramais","T","PLZ-Adressierung","extern","Ja","Nein"]
[6651,"Häselgehr","T","PLZ-Adressierung","extern","Ja","Nein"]
[6652,"Elbigenalp","T","PLZ-Adressierung","extern","Ja","Ja"]
[6653,"Bach","T","PLZ-Adressierung","extern","Ja","Nein"]
[6654,"Holzgau","T","PLZ-Adressierung","extern","Ja","Nein"]
[6655,"Steeg","T","PLZ-Adressierung","extern","Ja","Nein"]
[6670,"Forchach","T","PLZ-Adressierung","extern","Ja","Nein"]
[6671,"Weißenbach am Lech","T","PLZ-Adressierung","extern","Ja","Ja"]
[6672,"Nesselwängle","T","PLZ-Adressierung","extern","Ja","Nein"]
[6673,"Grän","T","PLZ-Adressierung","extern","Ja","Nein"]
[6675,"Tannheim","T","PLZ-Adressierung","extern","Ja","Ja"]
[6677,"Schattwald","T","PLZ-Adressierung","extern","Ja","Nein"]
[6682,"Vils","T","PLZ-Adressierung","extern","Ja","Ja"]
[6691,"Jungholz","T","PLZ-Adressierung","extern","Ja","Ja"]
[6700,"Bludenz","V","PLZ-Adressierung","extern","Ja","Ja"]
[6701,"Bludenz Postfach","V","PLZ-Postfach","extern","Nein","Ja"]
[6706,"Bürs","V","PLZ-Adressierung","extern","Ja","Ja"]
[6707,"Bürserberg","V","PLZ-Adressierung","extern","Ja","Nein"]
[6708,"Brand","V","PLZ-Adressierung","extern","Ja","Nein"]
[6710,"Nenzing","V","PLZ-Adressierung","extern","Ja","Ja"]
[6712,"Thüringen","V","PLZ-Adressierung","extern","Ja","Ja"]
[6713,"Ludesch","V","PLZ-Adressierung","extern","Ja","Ja"]
[6714,"Nüziders","V","PLZ-Adressierung","extern","Ja","Ja"]
[6719,"Bludesch","V","PLZ-Adressierung","extern","Ja","Nein"]
[6721,"Thüringerberg","V","PLZ-Adressierung","extern","Ja","Nein"]
[6722,"St. Gerold","V","PLZ-Adressierung","extern","Ja","Nein"]
[6723,"Blons","V","PLZ-Adressierung","extern","Ja","Nein"]
[6731,"Sonntag","V","PLZ-Adressierung","extern","Ja","Ja"]
[6733,"Fontanella","V","PLZ-Adressierung","extern","Ja","Nein"]
[6741,"Raggal","V","PLZ-Adressierung","extern","Ja","Nein"]
[6751,"Braz","V","PLZ-Adressierung","extern","Ja","Nein"]
[6752,"Dalaas","V","PLZ-Adressierung","extern","Ja","Ja"]
[6754,"Klösterle","V","PLZ-Adressierung","extern","Ja","Nein"]
[6762,"Stuben","V","PLZ-Adressierung","extern","Ja","Nein"]
[6763,"Zürs","V","PLZ-Adressierung","extern","Ja","Nein"]
[6764,"Lech","V","PLZ-Adressierung","extern","Ja","Ja"]
[6767,"Warth","V","PLZ-Adressierung","extern","Ja","Nein"]
[6771,"St. Anton im Montafon","V","PLZ-Adressierung","extern","Ja","Nein"]
[6773,"Vandans","V","PLZ-Adressierung","extern","Ja","Ja"]
[6774,"Tschagguns","V","PLZ-Adressierung","extern","Ja","Ja"]
[6780,"Schruns","V","PLZ-Adressierung","extern","Ja","Ja"]
[6787,"Gargellen","V","PLZ-Adressierung","extern","Ja","Nein"]
[6791,"St. Gallenkirch","V","PLZ-Adressierung","extern","Ja","Ja"]
[6793,"Gaschurn","V","PLZ-Adressierung","extern","Ja","Ja"]
[6794,"Partenen","V","PLZ-Adressierung","extern","Ja","Nein"]
[6800,"Feldkirch","V","PLZ-Adressierung","extern","Ja","Ja"]
[6801,"Feldkirch Postfach","V","PLZ-Postfach","extern","Nein","Ja"]
[6803,"Feldkirch","V","PLZ-Postfach","extern","Nein","Ja"]
[6804,"Feldkirch-Altenstadt","V","PLZ-Postfach","extern","Nein","Ja"]
[6805,"Feldkirch-Gisingen","V","PLZ-Postfach","extern","Nein","Ja"]
[6806,"Feldkirch-Tosters","V","PLZ-Postfach","extern","Nein","Ja"]
[6807,"Feldkirch-Tisis","V","PLZ-Postfach","extern","Nein","Ja"]
[6811,"Göfis","V","PLZ-Adressierung","extern","Ja","Nein"]
[6812,"Meiningen","V","PLZ-Adressierung","extern","Ja","Nein"]
[6820,"Frastanz","V","PLZ-Adressierung","extern","Ja","Ja"]
[6822,"Satteins","V","PLZ-Adressierung","extern","Ja","Ja"]
[6824,"Schlins","V","PLZ-Adressierung","extern","Ja","Nein"]
[6830,"Rankweil","V","PLZ-Adressierung","extern","Ja","Ja"]
[6832,"Sulz-Röthis","V","PLZ-Adressierung","extern","Ja","Ja"]
[6833,"Klaus-Weiler","V","PLZ-Adressierung","extern","Ja","Ja"]
[6834,"Übersaxen","V","PLZ-Adressierung","extern","Ja","Nein"]
[6836,"Viktorsberg","V","PLZ-Adressierung","extern","Ja","Nein"]
[6840,"Götzis","V","PLZ-Adressierung","extern","Ja","Ja"]
[6841,"Mäder","V","PLZ-Adressierung","extern","Ja","Ja"]
[6842,"Koblach","V","PLZ-Adressierung","extern","Ja","Ja"]
[6844,"Altach","V","PLZ-Adressierung","extern","Ja","Ja"]
[6845,"Hohenems","V","PLZ-Adressierung","extern","Ja","Ja"]
[6850,"Dornbirn","V","PLZ-Adressierung","extern","Ja","Ja"]
[6851,"Dornbirn Postfach","V","PLZ-Postfach","extern","Nein","Ja"]
[6852,"Dornbirn-Oberdorf","V","PLZ-Postfach","extern","Nein","Ja"]
[6853,"Dornbirn-Hatlerdorf","V","PLZ-Postfach","extern","Nein","Ja"]
[6854,"Dornbirn-Messepark","V","PLZ-Postfach","extern","Nein","Ja"]
[6857,"Dornbirn-Haselstauden","V","PLZ-Postfach","extern","Nein","Ja"]
[6858,"Schwarzach","V","PLZ-Adressierung","extern","Ja","Ja"]
[6861,"Alberschwende","V","PLZ-Adressierung","extern","Ja","Ja"]
[6863,"Egg","V","PLZ-Adressierung","extern","Ja","Ja"]
[6866,"Andelsbuch","V","PLZ-Adressierung","extern","Ja","Nein"]
[6867,"Schwarzenberg","V","PLZ-Adressierung","extern","Ja","Nein"]
[6870,"Bezau","V","PLZ-Adressierung","extern","Ja","Ja"]
[6874,"Bizau","V","PLZ-Adressierung","extern","Ja","Nein"]
[6881,"Mellau","V","PLZ-Adressierung","extern","Ja","Ja"]
[6882,"Schnepfau","V","PLZ-Adressierung","extern","Ja","Nein"]
[6883,"Au","V","PLZ-Adressierung","extern","Ja","Ja"]
[6884,"Damüls","V","PLZ-Adressierung","extern","Ja","Nein"]
[6886,"Schoppernau","V","PLZ-Adressierung","extern","Ja","Nein"]
[6888,"Schröcken","V","PLZ-Adressierung","extern","Ja","Nein"]
[6890,"Lustenau","V","PLZ-Adressierung","extern","Ja","Ja"]
[6893,"Lustenau-Rheindorf","V","PLZ-Postfach","extern","Nein","Ja"]
[6900,"Bregenz","V","PLZ-Adressierung","extern","Ja","Ja"]
[6901,"Bregenz Postfach","V","PLZ-Postfach","extern","Nein","Ja"]
[6903,"Bregenz-Vorkloster","V","PLZ-Postfach","extern","Nein","Ja"]
[6904,"Bregenz-Schendlingen","V","PLZ-Postfach","extern","Nein","Ja"]
[6905,"Bregenz-Achsiedlung","V","PLZ-Postfach","extern","Nein","Ja"]
[6911,"Lochau","V","PLZ-Adressierung","extern","Ja","Ja"]
[6912,"Hörbranz","V","PLZ-Adressierung","extern","Ja","Ja"]
[6914,"Hohenweiler","V","PLZ-Adressierung","extern","Ja","Nein"]
[6921,"Kennelbach","V","PLZ-Adressierung","extern","Ja","Ja"]
[6922,"Wolfurt","V","PLZ-Adressierung","extern","Ja","Ja"]
[6923,"Lauterach","V","PLZ-Adressierung","extern","Ja","Ja"]
[6932,"Langen bei Bregenz","V","PLZ-Adressierung","extern","Ja","Ja"]
[6933,"Doren","V","PLZ-Adressierung","extern","Ja","Nein"]
[6934,"Sulzberg","V","PLZ-Adressierung","extern","Ja","Nein"]
[6941,"Langenegg","V","PLZ-Adressierung","extern","Ja","Nein"]
[6942,"Krumbach","V","PLZ-Adressierung","extern","Ja","Ja"]
[6943,"Riefensberg","V","PLZ-Adressierung","extern","Ja","Nein"]
[6951,"Lingenau","V","PLZ-Adressierung","extern","Ja","Nein"]
[6952,"Hittisau","V","PLZ-Adressierung","extern","Ja","Ja"]
[6960,"Wolfurt-Bahnhof","V","PLZ-Adressierung","extern","Ja","Ja"]
[6961,"Wolfurt-Bahnhof Postfach","V","PLZ-Postfach","extern","Nein","Ja"]
[6971,"Hard","V","PLZ-Adressierung","extern","Ja","Ja"]
[6972,"Fußach","V","PLZ-Adressierung","extern","Ja","Ja"]
[6973,"Höchst","V","PLZ-Adressierung","extern","Ja","Ja"]
[6974,"Gaißau","V","PLZ-Adressierung","extern","Ja","Ja"]
[6991,"Riezlern","V","PLZ-Adressierung","extern","Ja","Ja"]
[6992,"Hirschegg","V","PLZ-Adressierung","extern","Ja","Ja"]
[6993,"Mittelberg","V","PLZ-Adressierung","extern","Ja","Nein"]
[7000,"Eisenstadt","B","PLZ-Adressierung","extern","Ja","Ja"]
[7001,"Eisenstadt Postfach","B","PLZ-Postfach","extern","Nein","Ja"]
[7002,"Eisenstadt","B","PLZ-Postfach","extern","Nein","Ja"]
[7011,"Siegendorf","B","PLZ-Adressierung","extern","Ja","Nein"]
[7013,"Klingenbach","B","PLZ-Adressierung","extern","Ja","Ja"]
[7021,"Draßburg","B","PLZ-Adressierung","extern","Ja","Ja"]
[7022,"Schattendorf","B","PLZ-Adressierung","extern","Ja","Ja"]
[7023,"Zemendorf","B","PLZ-Adressierung","extern","Ja","Nein"]
[7024,"Hirm","B","PLZ-Adressierung","extern","Ja","Ja"]
[7031,"Krensdorf","B","PLZ-Adressierung","extern","Ja","Nein"]
[7032,"Sigleß","B","PLZ-Adressierung","extern","Ja","Nein"]
[7033,"Pöttsching","B","PLZ-Adressierung","extern","Ja","Ja"]
[7034,"Zillingtal","B","PLZ-Adressierung","extern","Ja","Nein"]
[7035,"Steinbrunn","B","PLZ-Adressierung","extern","Ja","Ja"]
[7041,"Wulkaprodersdorf","B","PLZ-Adressierung","extern","Ja","Ja"]
[7051,"Großhöflein","B","PLZ-Adressierung","extern","Ja","Nein"]
[7052,"Müllendorf","B","PLZ-Adressierung","extern","Ja","Nein"]
[7053,"Hornstein","B","PLZ-Adressierung","extern","Ja","Ja"]
[7061,"Trausdorf an der Wulka","B","PLZ-Adressierung","extern","Ja","Nein"]
[7062,"St. Margarethen im Burgenland","B","PLZ-Adressierung","extern","Ja","Ja"]
[7063,"Oggau","B","PLZ-Adressierung","extern","Ja","Ja"]
[7064,"Oslip","B","PLZ-Adressierung","extern","Ja","Nein"]
[7071,"Rust","B","PLZ-Adressierung","extern","Ja","Ja"]
[7072,"Mörbisch am See","B","PLZ-Adressierung","extern","Ja","Ja"]
[7073,"Rust, Burgenland","B","InteressentenPLZ","extern","Nein","Ja"]
[7081,"Schützen am Gebirge","B","PLZ-Adressierung","extern","Ja","Nein"]
[7082,"Donnerskirchen","B","PLZ-Adressierung","extern","Ja","Nein"]
[7083,"Purbach am Neusiedler See","B","PLZ-Adressierung","extern","Ja","Ja"]
[7091,"Breitenbrunn","B","PLZ-Adressierung","extern","Ja","Ja"]
[7092,"Winden am See","B","PLZ-Adressierung","extern","Ja","Nein"]
[7093,"Jois","B","PLZ-Adressierung","extern","Ja","Nein"]
[7100,"Neusiedl am See","B","PLZ-Adressierung","extern","Ja","Ja"]
[7111,"Parndorf","B","PLZ-Adressierung","extern","Ja","Ja"]
[7121,"Weiden am See","B","PLZ-Adressierung","extern","Ja","Nein"]
[7122,"Gols","B","PLZ-Adressierung","extern","Ja","Ja"]
[7123,"Mönchhof","B","PLZ-Adressierung","extern","Ja","Ja"]
[7131,"Halbturn","B","PLZ-Adressierung","extern","Ja","Ja"]
[7132,"Frauenkirchen","B","PLZ-Adressierung","extern","Ja","Ja"]
[7141,"Podersdorf am See","B","PLZ-Adressierung","extern","Ja","Ja"]
[7142,"Illmitz","B","PLZ-Adressierung","extern","Ja","Ja"]
[7143,"Apetlon","B","PLZ-Adressierung","extern","Ja","Nein"]
[7151,"Wallern im Burgenland","B","PLZ-Adressierung","extern","Ja","Ja"]
[7152,"Pamhagen","B","PLZ-Adressierung","extern","Ja","Ja"]
[7161,"St. Andrä am Zicksee","B","PLZ-Adressierung","extern","Ja","Nein"]
[7162,"Tadten","B","PLZ-Adressierung","extern","Ja","Nein"]
[7163,"Andau","B","PLZ-Adressierung","extern","Ja","Ja"]
[7201,"Neudörfl","B","PLZ-Adressierung","extern","Ja","Ja"]
[7202,"Bad Sauerbrunn","B","PLZ-Adressierung","extern","Ja","Ja"]
[7203,"Wiesen","B","PLZ-Adressierung","extern","Ja","Nein"]
[7210,"Mattersburg","B","PLZ-Adressierung","extern","Ja","Ja"]
[7212,"Forchtenstein","B","PLZ-Adressierung","extern","Ja","Nein"]
[7221,"Marz","B","PLZ-Adressierung","extern","Ja","Nein"]
[7222,"Rohrbach bei Mattersburg","B","PLZ-Adressierung","extern","Ja","Ja"]
[7223,"Sieggraben","B","PLZ-Adressierung","extern","Ja","Nein"]
[7301,"Deutschkreutz","B","PLZ-Adressierung","extern","Ja","Ja"]
[7302,"Nikitsch","B","PLZ-Adressierung","extern","Ja","Nein"]
[7304,"Großwarasdorf","B","PLZ-Adressierung","extern","Ja","Nein"]
[7311,"Neckenmarkt","B","PLZ-Adressierung","extern","Ja","Nein"]
[7312,"Horitschon","B","PLZ-Adressierung","extern","Ja","Ja"]
[7321,"Lackendorf","B","PLZ-Adressierung","extern","Ja","Ja"]
[7322,"Lackenbach","B","PLZ-Adressierung","extern","Ja","Nein"]
[7323,"Ritzing","B","PLZ-Adressierung","extern","Ja","Nein"]
[7331,"Weppersdorf","B","PLZ-Adressierung","extern","Ja","Ja"]
[7332,"Kobersdorf","B","PLZ-Adressierung","extern","Ja","Ja"]
[7341,"Markt St. Martin","B","PLZ-Adressierung","extern","Ja","Nein"]
[7342,"Kaisersdorf","B","PLZ-Adressierung","extern","Ja","Nein"]
[7343,"Neutal","B","PLZ-Adressierung","extern","Ja","Nein"]
[7344,"Stoob","B","PLZ-Adressierung","extern","Ja","Nein"]
[7350,"Oberpullendorf","B","PLZ-Adressierung","extern","Ja","Ja"]
[7361,"Lutzmannsburg","B","PLZ-Adressierung","extern","Ja","Nein"]
[7371,"Unterrabnitz","B","PLZ-Adressierung","extern","Ja","Ja"]
[7372,"Draßmarkt","B","PLZ-Adressierung","extern","Ja","Nein"]
[7400,"Oberwart","B","PLZ-Adressierung","extern","Ja","Ja"]
[7411,"Markt Allhau","B","PLZ-Adressierung","extern","Ja","Ja"]
[7412,"Wolfau","B","PLZ-Adressierung","extern","Ja","Nein"]
[7421,"Tauchen-Schaueregg","St","PLZ-Adressierung","extern","Ja","Nein"]
[7422,"Riedlingsdorf","B","PLZ-Adressierung","extern","Ja","Ja"]
[7423,"Pinkafeld","B","PLZ-Adressierung","extern","Ja","Ja"]
[7431,"Bad Tatzmannsdorf","B","PLZ-Adressierung","extern","Ja","Ja"]
[7432,"Oberschützen","B","PLZ-Adressierung","extern","Ja","Ja"]
[7433,"Mariasdorf","B","PLZ-Adressierung","extern","Ja","Nein"]
[7434,"Bernstein","B","PLZ-Adressierung","extern","Ja","Ja"]
[7435,"Unterkohlstätten","B","PLZ-Adressierung","extern","Ja","Nein"]
[7441,"Pilgersdorf","B","PLZ-Adressierung","extern","Ja","Nein"]
[7442,"Lockenhaus","B","PLZ-Adressierung","extern","Ja","Ja"]
[7443,"Rattersdorf-Liebing","B","PLZ-Adressierung","extern","Ja","Nein"]
[7444,"Mannersdorf an der Rabnitz","B","PLZ-Adressierung","extern","Ja","Nein"]
[7451,"Oberloisdorf","B","PLZ-Adressierung","extern","Ja","Nein"]
[7452,"Unterpullendorf","B","PLZ-Adressierung","extern","Ja","Nein"]
[7453,"Steinberg-Dörfl","B","PLZ-Adressierung","extern","Ja","Nein"]
[7461,"Stadtschlaining","B","PLZ-Adressierung","extern","Ja","Ja"]
[7463,"Weiden bei Rechnitz","B","PLZ-Adressierung","extern","Ja","Nein"]
[7464,"Markt Neuhodis","B","PLZ-Adressierung","extern","Ja","Nein"]
[7471,"Rechnitz","B","PLZ-Adressierung","extern","Ja","Ja"]
[7472,"Schachendorf","B","PLZ-Adressierung","extern","Ja","Nein"]
[7473,"Hannersdorf","B","PLZ-Adressierung","extern","Ja","Nein"]
[7474,"Deutsch Schützen","B","PLZ-Adressierung","extern","Ja","Nein"]
[7501,"Rotenturm an der Pinka","B","PLZ-Adressierung","extern","Ja","Ja"]
[7503,"Großpetersdorf","B","PLZ-Adressierung","extern","Ja","Ja"]
[7511,"Mischendorf","B","PLZ-Adressierung","extern","Ja","Nein"]
[7512,"Kohfidisch","B","PLZ-Adressierung","extern","Ja","Nein"]
[7521,"Eberau","B","PLZ-Adressierung","extern","Ja","Nein"]
[7522,"Strem","B","PLZ-Adressierung","extern","Ja","Nein"]
[7531,"Kemeten","B","PLZ-Adressierung","extern","Ja","Ja"]
[7532,"Litzelsdorf","B","PLZ-Adressierung","extern","Ja","Nein"]
[7533,"Ollersdorf im Burgenland","B","PLZ-Adressierung","extern","Ja","Nein"]
[7534,"Olbendorf","B","PLZ-Adressierung","extern","Ja","Nein"]
[7535,"St. Michael im Burgenland","B","PLZ-Adressierung","extern","Ja","Ja"]
[7540,"Güssing","B","PLZ-Adressierung","extern","Ja","Ja"]
[7542,"Gerersdorf bei Güssing","B","PLZ-Adressierung","extern","Ja","Nein"]
[7543,"Kukmirn","B","PLZ-Adressierung","extern","Ja","Nein"]
[7551,"Stegersbach","B","PLZ-Adressierung","extern","Ja","Ja"]
[7552,"Stinatz","B","PLZ-Adressierung","extern","Ja","Nein"]
[7561,"Heiligenkreuz im Lafnitztal","B","PLZ-Adressierung","extern","Ja","Ja"]
[7562,"Eltendorf","B","PLZ-Adressierung","extern","Ja","Nein"]
[7563,"Königsdorf","B","PLZ-Adressierung","extern","Ja","Nein"]
[7564,"Dobersdorf","B","PLZ-Adressierung","extern","Ja","Nein"]
[7571,"Rudersdorf","B","PLZ-Adressierung","extern","Ja","Ja"]
[7572,"Deutsch Kaltenbrunn","B","PLZ-Adressierung","extern","Ja","Nein"]
[8010,"Graz","St","PLZ-Adressierung","extern","Ja","Ja"]
[8011,"Graz Postfach","St","PLZ-Postfach","extern","Nein","Ja"]
[8013,"Graz","St","PLZ-Postfach","extern","Nein","Ja"]
[8015,"Graz","St","PLZ-Postfach","extern","Nein","Ja"]
[8016,"Graz","St","PLZ-Postfach","extern","Nein","Ja"]
[8017,"Graz","St","PLZ-Postfach","extern","Nein","Ja"]
[8018,"Graz","St","PLZ-Postfach","extern","Nein","Ja"]
[8019,"Graz","St","PLZ-Postfach","extern","Nein","Ja"]
[8020,"Graz","St","PLZ-Adressierung","extern","Ja","Ja"]
[8021,"Graz Postfach","St","PLZ-Postfach","extern","Nein","Ja"]
[8022,"Graz","St","PLZ-Postfach","extern","Nein","Ja"]
[8023,"Graz","St","PLZ-Postfach","extern","Nein","Ja"]
[8024,"Graz","St","PLZ-Postfach","extern","Nein","Ja"]
[8025,"Graz","St","PLZ-Postfach","extern","Nein","Ja"]
[8026,"Graz","St","PLZ-Postfach","extern","Nein","Ja"]
[8027,"Graz","St","PLZ-Postfach","extern","Nein","Ja"]
[8028,"Graz","St","PLZ-Postfach","extern","Nein","Ja"]
[8029,"Graz","St","PLZ-Postfach","extern","Nein","Ja"]
[8035,"Graz","St","PLZ-Postfach","extern","Nein","Ja"]
[8036,"Graz","St","PLZ-Adressierung","extern","Ja","Ja"]
[8041,"Graz-Liebenau","St","PLZ-Adressierung","extern","Ja","Ja"]
[8042,"Graz-St. Peter","St","PLZ-Adressierung","extern","Ja","Ja"]
[8043,"Graz-Kroisbach","St","PLZ-Adressierung","extern","Ja","Ja"]
[8044,"Graz-Mariatrost","St","PLZ-Adressierung","extern","Ja","Ja"]
[8045,"Graz-Andritz","St","PLZ-Adressierung","extern","Ja","Ja"]
[8046,"Graz-St. Veit","St","PLZ-Adressierung","extern","Ja","Nein"]
[8047,"Graz-Ragnitz","St","PLZ-Adressierung","extern","Ja","Ja"]
[8051,"Graz-Gösting","St","PLZ-Adressierung","extern","Ja","Ja"]
[8052,"Graz-Wetzelsdorf","St","PLZ-Adressierung","extern","Ja","Ja"]
[8053,"Graz-Neuhart","St","PLZ-Adressierung","extern","Ja","Ja"]
[8054,"Graz-Straßgang","St","PLZ-Adressierung","extern","Ja","Ja"]
[8055,"Graz-Puntigam","St","PLZ-Adressierung","extern","Ja","Ja"]
[8061,"St. Radegund bei Graz","St","PLZ-Adressierung","extern","Ja","Ja"]
[8062,"Kumberg","St","PLZ-Adressierung","extern","Ja","Ja"]
[8063,"Eggersdorf bei Graz","St","PLZ-Adressierung","extern","Ja","Ja"]
[8071,"Hausmannstätten","St","PLZ-Adressierung","extern","Ja","Ja"]
[8072,"Fernitz","St","PLZ-Adressierung","extern","Ja","Ja"]
[8073,"Feldkirchen bei Graz","St","PLZ-Adressierung","extern","Ja","Ja"]
[8074,"Raaba","St","PLZ-Adressierung","extern","Ja","Ja"]
[8075,"Hart bei Graz","St","PLZ-Adressierung","extern","Ja","Ja"]
[8081,"Heiligenkreuz am Waasen","St","PLZ-Adressierung","extern","Ja","Ja"]
[8082,"Kirchbach in Steiermark","St","PLZ-Adressierung","extern","Ja","Ja"]
[8083,"St. Stefan im Rosental","St","PLZ-Adressierung","extern","Ja","Ja"]
[8091,"Jagerberg","St","PLZ-Adressierung","extern","Ja","Nein"]
[8092,"Mettersdorf am Saßbach","St","PLZ-Adressierung","extern","Ja","Nein"]
[8093,"St. Peter am Ottersbach","St","PLZ-Adressierung","extern","Ja","Ja"]
[8101,"Gratkorn","St","PLZ-Adressierung","extern","Ja","Ja"]
[8102,"Semriach","St","PLZ-Adressierung","extern","Ja","Ja"]
[8103,"Rein","St","PLZ-Adressierung","extern","Ja","Nein"]
[8111,"Judendorf-Straßengel","St","PLZ-Adressierung","extern","Ja","Ja"]
[8112,"Gratwein","St","PLZ-Adressierung","extern","Ja","Ja"]
[8113,"St. Oswald bei Plankenwarth","St","PLZ-Adressierung","extern","Ja","Nein"]
[8114,"Stübing","St","PLZ-Adressierung","extern","Ja","Nein"]
[8120,"Peggau","St","PLZ-Adressierung","extern","Ja","Nein"]
[8121,"Deutschfeistritz","St","PLZ-Adressierung","extern","Ja","Ja"]
[8122,"Waldstein","St","PLZ-Adressierung","extern","Ja","Nein"]
[8124,"Übelbach","St","PLZ-Adressierung","extern","Ja","Ja"]
[8130,"Frohnleiten","St","PLZ-Adressierung","extern","Ja","Ja"]
[8131,"Mixnitz","St","PLZ-Adressierung","extern","Ja","Nein"]
[8132,"Pernegg an der Mur","St","PLZ-Adressierung","extern","Ja","Nein"]
[8141,"Unterpremstätten","St","PLZ-Adressierung","extern","Ja","Ja"]
[8142,"Wundschuh","St","PLZ-Adressierung","extern","Ja","Ja"]
[8143,"Dobl","St","PLZ-Adressierung","extern","Ja","Nein"]
[8144,"Tobelbad","St","PLZ-Adressierung","extern","Ja","Nein"]
[8151,"Hitzendorf","St","PLZ-Adressierung","extern","Ja","Ja"]
[8152,"Stallhofen","St","PLZ-Adressierung","extern","Ja","Ja"]
[8153,"Geistthal","St","PLZ-Adressierung","extern","Ja","Nein"]
[8160,"Weiz","St","PLZ-Adressierung","extern","Ja","Ja"]
[8162,"Passail","St","PLZ-Adressierung","extern","Ja","Ja"]
[8163,"Fladnitz an der Teichalm","St","PLZ-Adressierung","extern","Ja","Nein"]
[8171,"St. Kathrein am Offenegg","St","PLZ-Adressierung","extern","Ja","Nein"]
[8172,"Heilbrunn","St","PLZ-Adressierung","extern","Ja","Nein"]
[8181,"St. Ruprecht an der Raab","St","PLZ-Adressierung","extern","Ja","Ja"]
[8182,"Puch bei Weiz","St","PLZ-Adressierung","extern","Ja","Nein"]
[8183,"Floing","St","PLZ-Adressierung","extern","Ja","Nein"]
[8184,"Anger","St","PLZ-Adressierung","extern","Ja","Ja"]
[8190,"Birkfeld","St","PLZ-Adressierung","extern","Ja","Ja"]
[8191,"Koglhof","St","PLZ-Adressierung","extern","Ja","Nein"]
[8192,"Strallegg","St","PLZ-Adressierung","extern","Ja","Nein"]
[8200,"Gleisdorf","St","PLZ-Adressierung","extern","Ja","Ja"]
[8211,"Großpesendorf","St","PLZ-Adressierung","extern","Ja","Nein"]
[8212,"Pischelsdorf in der Steiermark","St","PLZ-Adressierung","extern","Ja","Ja"]
[8221,"Hirnsdorf","St","PLZ-Adressierung","extern","Ja","Nein"]
[8222,"St. Johann bei Herberstein","St","PLZ-Adressierung","extern","Ja","Nein"]
[8223,"Stubenberg am See","St","PLZ-Adressierung","extern","Ja","Ja"]
[8224,"Kaindorf bei Hartberg","St","PLZ-Adressierung","extern","Ja","Ja"]
[8225,"Pöllau bei Hartberg","St","PLZ-Adressierung","extern","Ja","Ja"]
[8230,"Hartberg","St","PLZ-Adressierung","extern","Ja","Ja"]
[8232,"Grafendorf bei Hartberg","St","PLZ-Adressierung","extern","Ja","Ja"]
[8233,"Lafnitz","St","PLZ-Adressierung","extern","Ja","Nein"]
[8234,"Rohrbach an der Lafnitz","St","PLZ-Adressierung","extern","Ja","Nein"]
[8240,"Friedberg","St","PLZ-Adressierung","extern","Ja","Ja"]
[8241,"Dechantskirchen","St","PLZ-Adressierung","extern","Ja","Ja"]
[8242,"St. Lorenzen am Wechsel","St","PLZ-Adressierung","extern","Ja","Nein"]
[8243,"Pinggau","St","PLZ-Adressierung","extern","Ja","Ja"]
[8244,"Schäffern","St","PLZ-Adressierung","extern","Ja","Nein"]
[8250,"Vorau","St","PLZ-Adressierung","extern","Ja","Ja"]
[8251,"Bruck an der Lafnitz","St","PLZ-Adressierung","extern","Ja","Nein"]
[8252,"Mönichwald","St","PLZ-Adressierung","extern","Ja","Nein"]
[8253,"Waldbach","St","PLZ-Adressierung","extern","Ja","Ja"]
[8254,"Wenigzell","St","PLZ-Adressierung","extern","Ja","Ja"]
[8255,"St. Jakob","St","PLZ-Adressierung","extern","Ja","Nein"]
[8261,"Sinabelkirchen","St","PLZ-Adressierung","extern","Ja","Ja"]
[8262,"Ilz","St","PLZ-Adressierung","extern","Ja","Ja"]
[8263,"Großwilfersdorf","St","PLZ-Adressierung","extern","Ja","Ja"]
[8264,"Hainersdorf","St","PLZ-Adressierung","extern","Ja","Nein"]
[8265,"Großsteinbach","St","PLZ-Adressierung","extern","Ja","Nein"]
[8271,"Bad Waltersdorf","St","PLZ-Adressierung","extern","Ja","Ja"]
[8272,"Sebersdorf","St","PLZ-Adressierung","extern","Ja","Nein"]
[8273,"Ebersdorf","St","PLZ-Adressierung","extern","Ja","Nein"]
[8274,"Buch","St","PLZ-Adressierung","extern","Ja","Nein"]
[8280,"Fürstenfeld","St","PLZ-Adressierung","extern","Ja","Ja"]
[8282,"Loipersdorf bei Fürstenfeld","St","PLZ-Adressierung","extern","Ja","Ja"]
[8283,"Bad Blumau","St","PLZ-Adressierung","extern","Ja","Ja"]
[8291,"Burgau","St","PLZ-Adressierung","extern","Ja","Nein"]
[8292,"Neudau","St","PLZ-Adressierung","extern","Ja","Ja"]
[8293,"Wörth an der Lafnitz","St","PLZ-Adressierung","extern","Ja","Nein"]
[8294,"Unterrohr","St","PLZ-Adressierung","extern","Ja","Nein"]
[8295,"St. Johann in der Haide","St","PLZ-Adressierung","extern","Ja","Ja"]
[8301,"Laßnitzhöhe","St","PLZ-Adressierung","extern","Ja","Ja"]
[8302,"Nestelbach bei Graz","St","PLZ-Adressierung","extern","Ja","Nein"]
[8311,"Markt Hartmannsdorf","St","PLZ-Adressierung","extern","Ja","Ja"]
[8312,"Ottendorf an der Rittschein","St","PLZ-Adressierung","extern","Ja","Nein"]
[8313,"Breitenfeld an der Rittschein","St","PLZ-Adressierung","extern","Ja","Ja"]
[8321,"St. Margarethen an der Raab","St","PLZ-Adressierung","extern","Ja","Ja"]
[8322,"Studenzen","St","PLZ-Adressierung","extern","Ja","Ja"]
[8323,"St. Marein bei Graz","St","PLZ-Adressierung","extern","Ja","Ja"]
[8324,"Kirchberg an der Raab","St","PLZ-Adressierung","extern","Ja","Nein"]
[8330,"Feldbach","St","PLZ-Adressierung","extern","Ja","Ja"]
[8332,"Edelsbach bei Feldbach","St","PLZ-Adressierung","extern","Ja","Nein"]
[8333,"Riegersburg","St","PLZ-Adressierung","extern","Ja","Nein"]
[8334,"Lödersdorf","St","PLZ-Adressierung","extern","Ja","Nein"]
[8341,"Paldau","St","PLZ-Adressierung","extern","Ja","Ja"]
[8342,"Gnas","St","PLZ-Adressierung","extern","Ja","Ja"]
[8343,"Trautmannsdorf in Oststeiermark","St","PLZ-Adressierung","extern","Ja","Nein"]
[8344,"Bad Gleichenberg","St","PLZ-Adressierung","extern","Ja","Ja"]
[8345,"Straden","St","PLZ-Adressierung","extern","Ja","Ja"]
[8350,"Fehring","St","PLZ-Adressierung","extern","Ja","Ja"]
[8352,"Unterlamm","St","PLZ-Adressierung","extern","Ja","Nein"]
[8353,"Kapfenstein","St","PLZ-Adressierung","extern","Ja","Nein"]
[8354,"St. Anna am Aigen","St","PLZ-Adressierung","extern","Ja","Ja"]
[8355,"Tieschen","St","PLZ-Adressierung","extern","Ja","Nein"]
[8361,"Hatzendorf","St","PLZ-Adressierung","extern","Ja","Nein"]
[8362,"Söchau","St","PLZ-Adressierung","extern","Ja","Nein"]
[8380,"Jennersdorf","B","PLZ-Adressierung","extern","Ja","Ja"]
[8382,"Mogersdorf","B","PLZ-Adressierung","extern","Ja","Nein"]
[8383,"St. Martin an der Raab","B","PLZ-Adressierung","extern","Ja","Nein"]
[8384,"Minihof-Liebau","B","PLZ-Adressierung","extern","Ja","Ja"]
[8385,"Neuhaus am Klausenbach","B","PLZ-Adressierung","extern","Ja","Nein"]
[8401,"Kalsdorf bei Graz","St","PLZ-Adressierung","extern","Ja","Ja"]
[8402,"Werndorf","St","PLZ-Adressierung","extern","Ja","Nein"]
[8403,"Lebring","St","PLZ-Adressierung","extern","Ja","Ja"]
[8410,"Wildon","St","PLZ-Adressierung","extern","Ja","Ja"]
[8411,"Hengsberg","St","PLZ-Adressierung","extern","Ja","Nein"]
[8412,"Allerheiligen bei Wildon","St","PLZ-Adressierung","extern","Ja","Nein"]
[8413,"St. Georgen an der Stiefing","St","PLZ-Adressierung","extern","Ja","Nein"]
[8421,"Wolfsberg im Schwarzautal","St","PLZ-Adressierung","extern","Ja","Ja"]
[8422,"St. Nikolai ob Draßling","St","PLZ-Adressierung","extern","Ja","Nein"]
[8423,"St. Veit am Vogau","St","PLZ-Adressierung","extern","Ja","Nein"]
[8424,"Gabersdorf","St","PLZ-Adressierung","extern","Ja","Nein"]
[8430,"Leibnitz","St","PLZ-Adressierung","extern","Ja","Ja"]
[8435,"Wagna","St","PLZ-Adressierung","extern","Ja","Ja"]
[8441,"Fresing","St","PLZ-Adressierung","extern","Ja","Ja"]
[8442,"Kitzeck im Sausal","St","PLZ-Adressierung","extern","Ja","Nein"]
[8443,"Gleinstätten","St","PLZ-Adressierung","extern","Ja","Ja"]
[8444,"St. Andrä im Sausal","St","PLZ-Adressierung","extern","Ja","Nein"]
[8451,"Heimschuh","St","PLZ-Adressierung","extern","Ja","Nein"]
[8452,"Großklein","St","PLZ-Adressierung","extern","Ja","Ja"]
[8453,"St. Johann im Saggautal","St","PLZ-Adressierung","extern","Ja","Nein"]
[8454,"Arnfels","St","PLZ-Adressierung","extern","Ja","Ja"]
[8455,"Oberhaag","St","PLZ-Adressierung","extern","Ja","Nein"]
[8461,"Ehrenhausen","St","PLZ-Adressierung","extern","Ja","Ja"]
[8462,"Gamlitz","St","PLZ-Adressierung","extern","Ja","Ja"]
[8463,"Leutschach","St","PLZ-Adressierung","extern","Ja","Ja"]
[8471,"Spielfeld","St","PLZ-Adressierung","extern","Ja","Ja"]
[8472,"Straß in Steiermark","St","PLZ-Adressierung","extern","Ja","Ja"]
[8473,"Weitersfeld an der Mur","St","PLZ-Adressierung","extern","Ja","Nein"]
[8480,"Mureck","St","PLZ-Adressierung","extern","Ja","Ja"]
[8481,"Weinburg am Saßbach","St","PLZ-Adressierung","extern","Ja","Nein"]
[8482,"Gosdorf","St","PLZ-Adressierung","extern","Ja","Nein"]
[8483,"Deutsch Goritz","St","PLZ-Adressierung","extern","Ja","Nein"]
[8484,"Unterpurkla","St","PLZ-Adressierung","extern","Ja","Nein"]
[8490,"Bad Radkersburg","St","PLZ-Adressierung","extern","Ja","Ja"]
[8492,"Halbenrain","St","PLZ-Adressierung","extern","Ja","Nein"]
[8493,"Klöch","St","PLZ-Adressierung","extern","Ja","Nein"]
[8501,"Lieboch","St","PLZ-Adressierung","extern","Ja","Ja"]
[8502,"Lannach","St","PLZ-Adressierung","extern","Ja","Ja"]
[8503,"St. Josef Weststeiermark","St","PLZ-Adressierung","extern","Ja","Nein"]
[8504,"Preding","St","PLZ-Adressierung","extern","Ja","Ja"]
[8505,"St. Nikolai im Sausal","St","PLZ-Adressierung","extern","Ja","Ja"]
[8510,"Stainz","St","PLZ-Adressierung","extern","Ja","Ja"]
[8511,"St. Stefan ob Stainz","St","PLZ-Adressierung","extern","Ja","Ja"]
[8521,"Wettmannstätten","St","PLZ-Adressierung","extern","Ja","Nein"]
[8522,"Groß St. Florian","St","PLZ-Adressierung","extern","Ja","Ja"]
[8523,"Frauental an der Laßnitz","St","PLZ-Adressierung","extern","Ja","Ja"]
[8524,"Bad Gams","St","PLZ-Adressierung","extern","Ja","Nein"]
[8530,"Deutschlandsberg","St","PLZ-Adressierung","extern","Ja","Ja"]
[8541,"Schwanberg","St","PLZ-Adressierung","extern","Ja","Ja"]
[8542,"St. Peter im Sulmtal","St","PLZ-Adressierung","extern","Ja","Ja"]
[8543,"St. Martin im Sulmtal","St","PLZ-Adressierung","extern","Ja","Nein"]
[8544,"Pölfing-Brunn","St","PLZ-Adressierung","extern","Ja","Nein"]
[8551,"Wies","St","PLZ-Adressierung","extern","Ja","Ja"]
[8552,"Eibiswald","St","PLZ-Adressierung","extern","Ja","Ja"]
[8553,"St. Oswald ob Eibiswald","St","PLZ-Adressierung","extern","Ja","Nein"]
[8554,"Soboth","St","PLZ-Adressierung","extern","Ja","Nein"]
[8561,"Söding","St","PLZ-Adressierung","extern","Ja","Nein"]
[8562,"Mooskirchen","St","PLZ-Adressierung","extern","Ja","Nein"]
[8563,"Ligist","St","PLZ-Adressierung","extern","Ja","Ja"]
[8564,"Krottendorf-Gaisfeld","St","PLZ-Adressierung","extern","Ja","Ja"]
[8565,"St. Johann ob Hohenburg","St","PLZ-Adressierung","extern","Ja","Nein"]
[8570,"Voitsberg","St","PLZ-Adressierung","extern","Ja","Ja"]
[8572,"Bärnbach","St","PLZ-Adressierung","extern","Ja","Ja"]
[8573,"Kainach bei Voitsberg","St","PLZ-Adressierung","extern","Ja","Nein"]
[8580,"Köflach","St","PLZ-Adressierung","extern","Ja","Ja"]
[8582,"Rosental an der Kainach","St","PLZ-Adressierung","extern","Ja","Nein"]
[8583,"Edelschrott","St","PLZ-Adressierung","extern","Ja","Ja"]
[8584,"Hirschegg","St","PLZ-Adressierung","extern","Ja","Nein"]
[8591,"Maria Lankowitz","St","PLZ-Adressierung","extern","Ja","Nein"]
[8592,"Salla","St","PLZ-Adressierung","extern","Ja","Nein"]
[8593,"Graden","St","PLZ-Adressierung","extern","Ja","Nein"]
[8600,"Bruck an der Mur","St","PLZ-Adressierung","extern","Ja","Ja"]
[8601,"Bruck an der Mur","St","PLZ-Postfach","extern","Nein","Ja"]
[8605,"Kapfenberg","St","PLZ-Adressierung","extern","Ja","Ja"]
[8607,"Kapfenberg","St","PLZ-Postfach","extern","Nein","Ja"]
[8611,"St. Katharein an der Laming","St","PLZ-Adressierung","extern","Ja","Ja"]
[8612,"Tragöß-Oberort","St","PLZ-Adressierung","extern","Ja","Nein"]
[8614,"Breitenau","St","PLZ-Adressierung","extern","Ja","Ja"]
[8616,"Gasen","St","PLZ-Adressierung","extern","Ja","Nein"]
[8621,"Thörl","St","PLZ-Adressierung","extern","Ja","Ja"]
[8622,"Etmißl","St","PLZ-Adressierung","extern","Ja","Nein"]
[8623,"Aflenz Kurort","St","PLZ-Adressierung","extern","Ja","Ja"]
[8624,"Au","St","PLZ-Adressierung","extern","Ja","Nein"]
[8625,"Turnau","St","PLZ-Adressierung","extern","Ja","Nein"]
[8630,"Mariazell","St","PLZ-Adressierung","extern","Ja","Ja"]
[8632,"Gußwerk","St","PLZ-Adressierung","extern","Ja","Nein"]
[8634,"Wegscheid","St","PLZ-Adressierung","extern","Ja","Nein"]
[8635,"Gollrad","St","PLZ-Adressierung","extern","Ja","Nein"]
[8636,"Seewiesen","St","PLZ-Adressierung","extern","Ja","Nein"]
[8641,"St. Marein im Mürztal","St","PLZ-Adressierung","extern","Ja","Ja"]
[8642,"St. Lorenzen im Mürztal","St","PLZ-Adressierung","extern","Ja","Nein"]
[8643,"Allerheiligen im Mürztal","St","PLZ-Adressierung","extern","Ja","Ja"]
[8644,"Mürzhofen","St","PLZ-Adressierung","extern","Ja","Nein"]
[8650,"Kindberg","St","PLZ-Adressierung","extern","Ja","Ja"]
[8652,"Kindberg-Aumühl","St","PLZ-Adressierung","extern","Ja","Nein"]
[8653,"Stanz im Mürztal","St","PLZ-Adressierung","extern","Ja","Nein"]
[8654,"Fischbach","St","PLZ-Adressierung","extern","Ja","Nein"]
[8661,"Wartberg im Mürztal","St","PLZ-Adressierung","extern","Ja","Ja"]
[8662,"Mitterdorf im Mürztal","St","PLZ-Adressierung","extern","Ja","Nein"]
[8663,"Dorf Veitsch","St","PLZ-Adressierung","extern","Ja","Ja"]
[8664,"Großveitsch","St","PLZ-Adressierung","extern","Ja","Nein"]
[8665,"Langenwang","St","PLZ-Adressierung","extern","Ja","Ja"]
[8670,"Krieglach","St","PLZ-Adressierung","extern","Ja","Ja"]
[8671,"Alpl","St","PLZ-Adressierung","extern","Ja","Nein"]
[8672,"St. Kathrein am Hauenstein","St","PLZ-Adressierung","extern","Ja","Nein"]
[8673,"Ratten","St","PLZ-Adressierung","extern","Ja","Ja"]
[8674,"Rettenegg","St","PLZ-Adressierung","extern","Ja","Ja"]
[8680,"Mürzzuschlag","St","PLZ-Adressierung","extern","Ja","Ja"]
[8682,"Mürzzuschlag-Hönigsberg","St","PLZ-Adressierung","extern","Ja","Nein"]
[8684,"Spital am Semmering","St","PLZ-Adressierung","extern","Ja","Nein"]
[8685,"Steinhaus am Semmering","St","PLZ-Adressierung","extern","Ja","Nein"]
[8691,"Kapellen","St","PLZ-Adressierung","extern","Ja","Nein"]
[8692,"Neuberg an der Mürz","St","PLZ-Adressierung","extern","Ja","Ja"]
[8693,"Mürzsteg","St","PLZ-Adressierung","extern","Ja","Nein"]
[8694,"Frein an der Mürz","St","PLZ-Adressierung","extern","Ja","Nein"]
[8700,"Leoben","St","PLZ-Adressierung","extern","Ja","Ja"]
[8701,"Leoben","St","PLZ-Postfach","extern","Nein","Ja"]
[8704,"Leoben","St","PLZ-Postfach","extern","Nein","Ja"]
[8707,"Leoben","St","PLZ-Postfach","extern","Nein","Ja"]
[8712,"Niklasdorf","St","PLZ-Adressierung","extern","Ja","Ja"]
[8713,"St. Stefan ob Leoben","St","PLZ-Adressierung","extern","Ja","Ja"]
[8714,"Kraubath an der Mur","St","PLZ-Adressierung","extern","Ja","Ja"]
[8715,"St. Lorenzen bei Knittelfeld","St","PLZ-Adressierung","extern","Ja","Nein"]
[8720,"Knittelfeld","St","PLZ-Adressierung","extern","Ja","Ja"]
[8724,"Spielberg","St","PLZ-Adressierung","extern","Ja","Ja"]
[8731,"Bischoffeld","St","PLZ-Adressierung","extern","Ja","Nein"]
[8732,"Seckau","St","PLZ-Adressierung","extern","Ja","Nein"]
[8733,"St. Marein bei Knittelfeld","St","PLZ-Adressierung","extern","Ja","Nein"]
[8734,"Großlobming","St","PLZ-Adressierung","extern","Ja","Nein"]
[8740,"Zeltweg","St","PLZ-Adressierung","extern","Ja","Ja"]
[8741,"Weißkirchen in Steiermark","St","PLZ-Adressierung","extern","Ja","Ja"]
[8742,"Obdach","St","PLZ-Adressierung","extern","Ja","Ja"]
[8750,"Judenburg","St","PLZ-Adressierung","extern","Ja","Ja"]
[8752,"Fohnsdorf-Arena","St","PLZ-Postfach","extern","Nein","Ja"]
[8753,"Fohnsdorf","St","PLZ-Adressierung","extern","Ja","Ja"]
[8754,"Thalheim","St","PLZ-Adressierung","extern","Ja","Nein"]
[8755,"St. Peter ob Judenburg","St","PLZ-Adressierung","extern","Ja","Nein"]
[8756,"St. Georgen ob Judenburg","St","PLZ-Adressierung","extern","Ja","Nein"]
[8761,"Pöls","St","PLZ-Adressierung","extern","Ja","Ja"]
[8762,"Oberzeiring","St","PLZ-Adressierung","extern","Ja","Ja"]
[8763,"Möderbrugg","St","PLZ-Adressierung","extern","Ja","Ja"]
[8764,"Pusterwald","St","PLZ-Adressierung","extern","Ja","Nein"]
[8765,"St. Johann am Tauern","St","PLZ-Adressierung","extern","Ja","Nein"]
[8770,"St. Michael in Obersteiermark","St","PLZ-Adressierung","extern","Ja","Ja"]
[8772,"Timmersdorf","St","PLZ-Adressierung","extern","Ja","Nein"]
[8773,"Kammern im Liesingtal","St","PLZ-Adressierung","extern","Ja","Ja"]
[8774,"Mautern in Steiermark","St","PLZ-Adressierung","extern","Ja","Nein"]
[8775,"Kalwang","St","PLZ-Adressierung","extern","Ja","Ja"]
[8781,"Wald am Schoberpaß","St","PLZ-Adressierung","extern","Ja","Nein"]
[8782,"Treglwang","St","PLZ-Adressierung","extern","Ja","Nein"]
[8783,"Gaishorn am See","St","PLZ-Adressierung","extern","Ja","Nein"]
[8784,"Trieben","St","PLZ-Adressierung","extern","Ja","Ja"]
[8785,"Hohentauern","St","PLZ-Adressierung","extern","Ja","Nein"]
[8786,"Rottenmann","St","PLZ-Adressierung","extern","Ja","Ja"]
[8790,"Eisenerz","St","PLZ-Adressierung","extern","Ja","Ja"]
[8792,"St. Peter-Freienstein","St","PLZ-Adressierung","extern","Ja","Nein"]
[8793,"Trofaiach","St","PLZ-Adressierung","extern","Ja","Ja"]
[8794,"Vordernberg","St","PLZ-Adressierung","extern","Ja","Nein"]
[8795,"Radmer","St","PLZ-Adressierung","extern","Ja","Nein"]
[8800,"Unzmarkt","St","PLZ-Adressierung","extern","Ja","Ja"]
[8811,"Scheifling","St","PLZ-Adressierung","extern","Ja","Ja"]
[8812,"Mariahof","St","PLZ-Adressierung","extern","Ja","Nein"]
[8813,"St. Lambrecht","St","PLZ-Adressierung","extern","Ja","Nein"]
[8820,"Neumarkt in Steiermark","St","PLZ-Adressierung","extern","Ja","Ja"]
[8822,"Mühlen","St","PLZ-Adressierung","extern","Ja","Nein"]
[8831,"Niederwölz","St","PLZ-Adressierung","extern","Ja","Nein"]
[8832,"Oberwölz","St","PLZ-Adressierung","extern","Ja","Ja"]
[8833,"Teufenbach","St","PLZ-Adressierung","extern","Ja","Nein"]
[8841,"Frojach","St","PLZ-Adressierung","extern","Ja","Nein"]
[8842,"Katsch an der Mur","St","PLZ-Adressierung","extern","Ja","Ja"]
[8843,"St. Peter am Kammersberg","St","PLZ-Adressierung","extern","Ja","Nein"]
[8844,"Schöder","St","PLZ-Adressierung","extern","Ja","Nein"]
[8850,"Murau","St","PLZ-Adressierung","extern","Ja","Ja"]
[8852,"Stolzalpe","St","PLZ-Adressierung","extern","Ja","Nein"]
[8853,"Ranten","St","PLZ-Adressierung","extern","Ja","Nein"]
[8854,"Krakaudorf","St","PLZ-Adressierung","extern","Ja","Nein"]
[8861,"St. Georgen ob Murau","St","PLZ-Adressierung","extern","Ja","Nein"]
[8862,"Stadl an der Mur","St","PLZ-Adressierung","extern","Ja","Ja"]
[8863,"Predlitz","St","PLZ-Adressierung","extern","Ja","Nein"]
[8864,"Turrach","St","PLZ-Adressierung","extern","Ja","Nein"]
[8900,"Selzthal","St","PLZ-Adressierung","extern","Ja","Nein"]
[8903,"Lassing","St","PLZ-Adressierung","extern","Ja","Nein"]
[8904,"Ardning","St","PLZ-Adressierung","extern","Ja","Nein"]
[8911,"Admont","St","PLZ-Adressierung","extern","Ja","Ja"]
[8912,"Johnsbach","St","PLZ-Adressierung","extern","Ja","Nein"]
[8913,"Weng","St","PLZ-Adressierung","extern","Ja","Nein"]
[8920,"Hieflau","St","PLZ-Adressierung","extern","Ja","Ja"]
[8921,"Lainbach","St","PLZ-Adressierung","extern","Ja","Nein"]
[8922,"Gams bei Hieflau","St","PLZ-Adressierung","extern","Ja","Nein"]
[8923,"Palfau","St","PLZ-Adressierung","extern","Ja","Nein"]
[8924,"Wildalpen","St","PLZ-Adressierung","extern","Ja","Nein"]
[8931,"Landl","St","PLZ-Adressierung","extern","Ja","Ja"]
[8932,"Weißenbach an der Enns","St","PLZ-Adressierung","extern","Ja","Nein"]
[8933,"St. Gallen","St","PLZ-Adressierung","extern","Ja","Ja"]
[8934,"Altenmarkt bei St. Gallen","St","PLZ-Adressierung","extern","Ja","Nein"]
[8940,"Liezen","St","PLZ-Adressierung","extern","Ja","Ja"]
[8942,"Wörschach","St","PLZ-Adressierung","extern","Ja","Nein"]
[8943,"Aigen im Ennstal","St","PLZ-Adressierung","extern","Ja","Ja"]
[8950,"Stainach","St","PLZ-Adressierung","extern","Ja","Ja"]
[8951,"Trautenfels","St","PLZ-Adressierung","extern","Ja","Nein"]
[8952,"Irdning","St","PLZ-Adressierung","extern","Ja","Ja"]
[8953,"Donnersbach","St","PLZ-Adressierung","extern","Ja","Nein"]
[8954,"St. Martin am Grimming","St","PLZ-Adressierung","extern","Ja","Nein"]
[8960,"Öblarn","St","PLZ-Adressierung","extern","Ja","Ja"]
[8961,"Stein an der Enns","St","PLZ-Adressierung","extern","Ja","Nein"]
[8962,"Gröbming","St","PLZ-Adressierung","extern","Ja","Ja"]
[8965,"Pruggern","St","PLZ-Adressierung","extern","Ja","Nein"]
[8966,"Aich-Assach","St","PLZ-Adressierung","extern","Ja","Nein"]
[8967,"Haus","St","PLZ-Adressierung","extern","Ja","Ja"]
[8970,"Schladming","St","PLZ-Adressierung","extern","Ja","Ja"]
[8971,"Rohrmoos-Untertal","St","PLZ-Adressierung","extern","Ja","Nein"]
[8972,"Ramsau","St","PLZ-Adressierung","extern","Ja","Ja"]
[8973,"Pichl","St","PLZ-Adressierung","extern","Ja","Nein"]
[8974,"Mandling","St","PLZ-Adressierung","extern","Ja","Nein"]
[8982,"Tauplitz","St","PLZ-Adressierung","extern","Ja","Nein"]
[8983,"Bad Mitterndorf","St","PLZ-Adressierung","extern","Ja","Ja"]
[8984,"Kainisch","St","PLZ-Adressierung","extern","Ja","Nein"]
[8990,"Bad Aussee","St","PLZ-Adressierung","extern","Ja","Ja"]
[8992,"Altaussee","St","PLZ-Adressierung","extern","Ja","Ja"]
[8993,"Grundlsee","St","PLZ-Adressierung","extern","Ja","Nein"]
[9010,"Klagenfurt am Wörthersee","K","PLZ-Postfach","extern","Nein","Ja"]
[9013,"Klagenfurt am Wörthersee","K","PLZ-Postfach","extern","Nein","Ja"]
[9020,"Klagenfurt am Wörthersee","K","PLZ-Adressierung","extern","Ja","Ja"]
[9021,"Klagenfurt am Wörthersee Postfach","K","PLZ-Postfach","extern","Nein","Ja"]
[9022,"Klagenfurt am Wörthersee","K","PLZ-Postfach","extern","Nein","Ja"]
[9023,"Klagenfurt am Wörthersee","K","PLZ-Postfach","extern","Nein","Ja"]
[9024,"Klagenfurt am Wörthersee","K","PLZ-Postfach","extern","Nein","Ja"]
[9025,"Klagenfurt am Wörthersee","K","PLZ-Postfach","extern","Nein","Ja"]
[9026,"Klagenfurt am Wörthersee","K","PLZ-Postfach","extern","Nein","Ja"]
[9027,"Klagenfurt am Wörthersee","K","PLZ-Postfach","extern","Nein","Ja"]
[9028,"Klagenfurt am Wörthersee","K","PLZ-Postfach","extern","Nein","Ja"]
[9029,"Klagenfurt am Wörthersee","K","PLZ-Postfach","extern","Nein","Ja"]
[9061,"Klagenfurt-Wölfnitz","K","PLZ-Adressierung","extern","Ja","Ja"]
[9062,"Moosburg","K","PLZ-Adressierung","extern","Ja","Ja"]
[9063,"Maria Saal","K","PLZ-Adressierung","extern","Ja","Ja"]
[9064,"Pischeldorf","K","PLZ-Adressierung","extern","Ja","Ja"]
[9065,"Ebenthal","K","PLZ-Adressierung","extern","Ja","Ja"]
[9071,"Köttmannsdorf","K","PLZ-Adressierung","extern","Ja","Ja"]
[9072,"Ludmannsdorf","K","PLZ-Adressierung","extern","Ja","Nein"]
[9073,"Klagenfurt-Viktring","K","PLZ-Adressierung","extern","Ja","Ja"]
[9074,"Keutschach","K","PLZ-Adressierung","extern","Ja","Ja"]
[9081,"Reifnitz","K","PLZ-Adressierung","extern","Ja","Ja"]
[9082,"Maria Wörth","K","PLZ-Adressierung","extern","Ja","Nein"]
[9100,"Völkermarkt","K","PLZ-Adressierung","extern","Ja","Ja"]
[9102,"Mittertrixen","K","PLZ-Adressierung","extern","Ja","Nein"]
[9103,"Diex","K","PLZ-Adressierung","extern","Ja","Ja"]
[9104,"Pustritz","K","PLZ-Adressierung","extern","Ja","Nein"]
[9111,"Haimburg","K","PLZ-Adressierung","extern","Ja","Nein"]
[9112,"Griffen","K","PLZ-Adressierung","extern","Ja","Ja"]
[9113,"Ruden","K","PLZ-Adressierung","extern","Ja","Ja"]
[9121,"Tainach","K","PLZ-Adressierung","extern","Ja","Ja"]
[9122,"St. Kanzian am Klopeiner See","K","PLZ-Adressierung","extern","Ja","Ja"]
[9123,"St. Primus","K","PLZ-Adressierung","extern","Ja","Nein"]
[9125,"Kühnsdorf","K","PLZ-Adressierung","extern","Ja","Ja"]
[9130,"Poggersdorf","K","PLZ-Adressierung","extern","Ja","Nein"]
[9131,"Grafenstein","K","PLZ-Adressierung","extern","Ja","Ja"]
[9132,"Gallizien","K","PLZ-Adressierung","extern","Ja","Nein"]
[9133,"Miklauzhof","K","PLZ-Adressierung","extern","Ja","Nein"]
[9135,"Bad Eisenkappel","K","PLZ-Adressierung","extern","Ja","Ja"]
[9141,"Eberndorf","K","PLZ-Adressierung","extern","Ja","Ja"]
[9142,"Globasnitz","K","PLZ-Adressierung","extern","Ja","Ja"]
[9143,"St. Michael ob Bleiburg","K","PLZ-Adressierung","extern","Ja","Nein"]
[9150,"Bleiburg","K","PLZ-Adressierung","extern","Ja","Ja"]
[9155,"Neuhaus","K","PLZ-Adressierung","extern","Ja","Nein"]
[9161,"Maria Rain","K","PLZ-Adressierung","extern","Ja","Ja"]
[9162,"Strau","K","PLZ-Adressierung","extern","Ja","Ja"]
[9163,"Unterbergen","K","PLZ-Adressierung","extern","Ja","Nein"]
[9170,"Ferlach","K","PLZ-Adressierung","extern","Ja","Ja"]
[9173,"St. Margareten im Rosental","K","PLZ-Adressierung","extern","Ja","Nein"]
[9181,"Feistritz im Rosental","K","PLZ-Adressierung","extern","Ja","Ja"]
[9182,"Maria Elend","K","PLZ-Adressierung","extern","Ja","Nein"]
[9183,"Rosenbach","K","PLZ-Adressierung","extern","Ja","Nein"]
[9184,"St. Jakob im Rosental","K","PLZ-Adressierung","extern","Ja","Ja"]
[9201,"Krumpendorf","K","PLZ-Adressierung","extern","Ja","Ja"]
[9210,"Pörtschach am Wörther See","K","PLZ-Adressierung","extern","Ja","Ja"]
[9212,"Techelsberg am Wörther See","K","PLZ-Adressierung","extern","Ja","Nein"]
[9220,"Velden am Wörther See","K","PLZ-Adressierung","extern","Ja","Ja"]
[9231,"Köstenberg","K","PLZ-Adressierung","extern","Ja","Nein"]
[9232,"Rosegg","K","PLZ-Adressierung","extern","Ja","Ja"]
[9241,"Wernberg","K","PLZ-Adressierung","extern","Ja","Ja"]
[9300,"St. Veit an der Glan","K","PLZ-Adressierung","extern","Ja","Ja"]
[9302,"St. Veit an der Glan","K","PLZ-Postfach","extern","Nein","Ja"]
[9311,"Kraig","K","PLZ-Adressierung","extern","Ja","Nein"]
[9312,"Meiselding","K","PLZ-Adressierung","extern","Ja","Nein"]
[9313,"St. Georgen am Längsee","K","PLZ-Adressierung","extern","Ja","Nein"]
[9314,"Launsdorf","K","PLZ-Adressierung","extern","Ja","Ja"]
[9321,"Kappel am Krappfeld","K","PLZ-Adressierung","extern","Ja","Nein"]
[9322,"Micheldorf","K","PLZ-Adressierung","extern","Ja","Nein"]
[9323,"Wildbad Einöd","St","PLZ-Adressierung","extern","Ja","Nein"]
[9330,"Treibach-Althofen","K","PLZ-Adressierung","extern","Ja","Ja"]
[9334,"Guttaring","K","PLZ-Adressierung","extern","Ja","Nein"]
[9335,"Lölling","K","PLZ-Adressierung","extern","Ja","Nein"]
[9341,"Straßburg","K","PLZ-Adressierung","extern","Ja","Ja"]
[9342,"Gurk","K","PLZ-Adressierung","extern","Ja","Nein"]
[9343,"Zweinitz","K","PLZ-Adressierung","extern","Ja","Nein"]
[9344,"Weitensfeld","K","PLZ-Adressierung","extern","Ja","Ja"]
[9345,"Kleinglödnitz","K","PLZ-Adressierung","extern","Ja","Nein"]
[9346,"Glödnitz","K","PLZ-Adressierung","extern","Ja","Nein"]
[9360,"Friesach","K","PLZ-Adressierung","extern","Ja","Ja"]
[9361,"St. Salvator","K","PLZ-Adressierung","extern","Ja","Nein"]
[9362,"Grades","K","PLZ-Adressierung","extern","Ja","Nein"]
[9363,"Metnitz","K","PLZ-Adressierung","extern","Ja","Ja"]
[9371,"Brückl","K","PLZ-Adressierung","extern","Ja","Ja"]
[9372,"Eberstein","K","PLZ-Adressierung","extern","Ja","Nein"]
[9373,"Klein St. Paul","K","PLZ-Adressierung","extern","Ja","Ja"]
[9374,"Wieting","K","PLZ-Adressierung","extern","Ja","Nein"]
[9375,"Hüttenberg","K","PLZ-Adressierung","extern","Ja","Ja"]
[9376,"Knappenberg","K","PLZ-Adressierung","extern","Ja","Nein"]
[9400,"Wolfsberg","K","PLZ-Adressierung","extern","Ja","Ja"]
[9402,"Wolfsberg, Kärnten","K","PLZ-Postfach","extern","Nein","Ja"]
[9411,"St. Michael","K","PLZ-Adressierung","extern","Ja","Nein"]
[9412,"St. Margarethen im Lavanttal","K","PLZ-Adressierung","extern","Ja","Nein"]
[9413,"St. Gertraud","K","PLZ-Adressierung","extern","Ja","Nein"]
[9421,"Eitweg","K","PLZ-Adressierung","extern","Ja","Ja"]
[9422,"Maria Rojach","K","PLZ-Adressierung","extern","Ja","Nein"]
[9423,"St. Georgen","K","PLZ-Adressierung","extern","Ja","Nein"]
[9431,"St. Stefan","K","PLZ-Adressierung","extern","Ja","Ja"]
[9433,"St. Andrä","K","PLZ-Adressierung","extern","Ja","Ja"]
[9441,"Twimberg","K","PLZ-Adressierung","extern","Ja","Nein"]
[9451,"Preitenegg","K","PLZ-Adressierung","extern","Ja","Nein"]
[9461,"Prebl","K","PLZ-Adressierung","extern","Ja","Nein"]
[9462,"Bad St. Leonhard im Lavanttal","K","PLZ-Adressierung","extern","Ja","Ja"]
[9463,"Reichenfels","K","PLZ-Adressierung","extern","Ja","Nein"]
[9470,"St. Paul im Lavanttal","K","PLZ-Adressierung","extern","Ja","Ja"]
[9472,"Ettendorf","K","PLZ-Adressierung","extern","Ja","Nein"]
[9473,"Lavamünd","K","PLZ-Adressierung","extern","Ja","Ja"]
[9500,"Villach","K","PLZ-Adressierung","extern","Ja","Ja"]
[9501,"Villach","K","PLZ-Postfach","extern","Nein","Ja"]
[9503,"Villach","K","PLZ-Postfach","extern","Nein","Ja"]
[9504,"Villach-Warmbad Villach","K","PLZ-Adressierung","extern","Ja","Nein"]
[9505,"Villach","K","PLZ-Postfach","extern","Nein","Ja"]
[9506,"Villach","K","PLZ-Postfach","extern","Nein","Ja"]
[9507,"Villach","K","PLZ-Postfach","extern","Nein","Ja"]
[9508,"Villach","K","PLZ-Postfach","extern","Nein","Ja"]
[9520,"Sattendorf","K","PLZ-Adressierung","extern","Ja","Nein"]
[9521,"Treffen","K","PLZ-Adressierung","extern","Ja","Ja"]
[9523,"Villach-Landskron","K","PLZ-Adressierung","extern","Ja","Ja"]
[9524,"Villach-St. Magdalen","K","PLZ-Adressierung","extern","Ja","Ja"]
[9530,"Bad Bleiberg","K","PLZ-Adressierung","extern","Ja","Ja"]
[9531,"Kreuth","K","PLZ-Adressierung","extern","Ja","Nein"]
[9535,"Schiefling","K","PLZ-Adressierung","extern","Ja","Ja"]
[9536,"St. Egyden","K","PLZ-Adressierung","extern","Ja","Nein"]
[9541,"Einöde","K","PLZ-Adressierung","extern","Ja","Nein"]
[9542,"Afritz","K","PLZ-Adressierung","extern","Ja","Ja"]
[9543,"Arriach","K","PLZ-Adressierung","extern","Ja","Nein"]
[9544,"Feld am See","K","PLZ-Adressierung","extern","Ja","Nein"]
[9545,"Radenthein","K","PLZ-Adressierung","extern","Ja","Ja"]
[9546,"Bad Kleinkirchheim","K","PLZ-Adressierung","extern","Ja","Ja"]
[9551,"Bodensdorf","K","PLZ-Adressierung","extern","Ja","Ja"]
[9552,"Steindorf am Ossiacher See","K","PLZ-Adressierung","extern","Ja","Nein"]
[9554,"St. Urban","K","PLZ-Adressierung","extern","Ja","Nein"]
[9555,"Glanegg","K","PLZ-Adressierung","extern","Ja","Ja"]
[9556,"Liebenfels","K","PLZ-Adressierung","extern","Ja","Ja"]
[9560,"Feldkirchen in Kärnten","K","PLZ-Adressierung","extern","Ja","Ja"]
[9562,"Himmelberg","K","PLZ-Adressierung","extern","Ja","Nein"]
[9563,"Gnesau","K","PLZ-Adressierung","extern","Ja","Nein"]
[9564,"Patergassen","K","PLZ-Adressierung","extern","Ja","Ja"]
[9565,"Ebene Reichenau","K","PLZ-Adressierung","extern","Ja","Nein"]
[9570,"Ossiach","K","PLZ-Adressierung","extern","Ja","Nein"]
[9571,"Sirnitz","K","PLZ-Adressierung","extern","Ja","Ja"]
[9572,"Deutsch Griffen","K","PLZ-Adressierung","extern","Ja","Nein"]
[9580,"Villach-Drobollach am Faaker See","K","PLZ-Adressierung","extern","Ja","Ja"]
[9581,"Ledenitzen","K","PLZ-Adressierung","extern","Ja","Ja"]
[9582,"Latschach","K","PLZ-Adressierung","extern","Ja","Nein"]
[9583,"Faak am See","K","PLZ-Adressierung","extern","Ja","Nein"]
[9584,"Finkenstein","K","PLZ-Adressierung","extern","Ja","Nein"]
[9585,"Gödersdorf","K","PLZ-Adressierung","extern","Ja","Nein"]
[9586,"Fürnitz","K","PLZ-Adressierung","extern","Ja","Ja"]
[9587,"Riegersdorf","K","PLZ-Adressierung","extern","Ja","Ja"]
[9601,"Arnoldstein","K","PLZ-Adressierung","extern","Ja","Ja"]
[9602,"Thörl-Maglern","K","PLZ-Adressierung","extern","Ja","Ja"]
[9611,"Nötsch","K","PLZ-Adressierung","extern","Ja","Ja"]
[9612,"St. Georgen im Gailtal","K","PLZ-Adressierung","extern","Ja","Nein"]
[9613,"Feistritz an der Gail","K","PLZ-Adressierung","extern","Ja","Nein"]
[9614,"Vorderberg","K","PLZ-Adressierung","extern","Ja","Nein"]
[9615,"Görtschach","K","PLZ-Adressierung","extern","Ja","Nein"]
[9620,"Hermagor","K","PLZ-Adressierung","extern","Ja","Ja"]
[9622,"Weißbriach","K","PLZ-Adressierung","extern","Ja","Nein"]
[9623,"St. Stefan an der Gail","K","PLZ-Adressierung","extern","Ja","Ja"]
[9624,"Egg","K","PLZ-Adressierung","extern","Ja","Nein"]
[9631,"Jenig","K","PLZ-Adressierung","extern","Ja","Nein"]
[9632,"Kirchbach","K","PLZ-Adressierung","extern","Ja","Ja"]
[9633,"Reisach","K","PLZ-Adressierung","extern","Ja","Nein"]
[9634,"Gundersheim","K","PLZ-Adressierung","extern","Ja","Nein"]
[9635,"Dellach","K","PLZ-Adressierung","extern","Ja","Nein"]
[9640,"Kötschach-Mauthen","K","PLZ-Adressierung","extern","Ja","Ja"]
[9651,"St. Jakob im Lesachtal","K","PLZ-Adressierung","extern","Ja","Nein"]
[9652,"Birnbaum","K","PLZ-Adressierung","extern","Ja","Nein"]
[9653,"Liesing","K","PLZ-Adressierung","extern","Ja","Nein"]
[9654,"St. Lorenzen im Lesachtal","K","PLZ-Adressierung","extern","Ja","Ja"]
[9655,"Maria Luggau","K","PLZ-Adressierung","extern","Ja","Nein"]
[9701,"Rothenthurn","K","PLZ-Adressierung","extern","Ja","Nein"]
[9702,"Ferndorf","K","PLZ-Adressierung","extern","Ja","Ja"]
[9710,"Feistritz an der Drau","K","PLZ-Adressierung","extern","Ja","Ja"]
[9711,"Paternion","K","PLZ-Adressierung","extern","Ja","Nein"]
[9712,"Fresach","K","PLZ-Adressierung","extern","Ja","Nein"]
[9713,"Zlan","K","PLZ-Adressierung","extern","Ja","Ja"]
[9714,"Stockenboi","K","PLZ-Adressierung","extern","Ja","Nein"]
[9721,"Weißenstein","K","PLZ-Adressierung","extern","Ja","Ja"]
[9722,"Gummern","K","PLZ-Adressierung","extern","Ja","Nein"]
[9751,"Sachsenburg","K","PLZ-Adressierung","extern","Ja","Nein"]
[9753,"Lind im Drautal","K","PLZ-Adressierung","extern","Ja","Nein"]
[9754,"Steinfeld","K","PLZ-Adressierung","extern","Ja","Ja"]
[9761,"Greifenburg","K","PLZ-Adressierung","extern","Ja","Ja"]
[9762,"Weißensee","K","PLZ-Adressierung","extern","Ja","Ja"]
[9771,"Berg im Drautal","K","PLZ-Adressierung","extern","Ja","Nein"]
[9772,"Dellach","K","PLZ-Adressierung","extern","Ja","Ja"]
[9773,"Irschen","K","PLZ-Adressierung","extern","Ja","Nein"]
[9781,"Oberdrauburg","K","PLZ-Adressierung","extern","Ja","Ja"]
[9782,"Nikolsdorf","T","PLZ-Adressierung","extern","Ja","Nein"]
[9800,"Spittal an der Drau","K","PLZ-Adressierung","extern","Ja","Ja"]
[9802,"Spittal an der Drau","K","PLZ-Postfach","extern","Nein","Ja"]
[9803,"Spittal an der Drau","K","PLZ-Postfach","extern","Nein","Ja"]
[9805,"Baldramsdorf","K","PLZ-Adressierung","extern","Ja","Nein"]
[9811,"Lendorf","K","PLZ-Adressierung","extern","Ja","Nein"]
[9812,"Pusarnitz","K","PLZ-Adressierung","extern","Ja","Nein"]
[9813,"Möllbrücke","K","PLZ-Adressierung","extern","Ja","Ja"]
[9814,"Mühldorf","K","PLZ-Adressierung","extern","Ja","Nein"]
[9815,"Kolbnitz","K","PLZ-Adressierung","extern","Ja","Ja"]
[9816,"Penk","K","PLZ-Adressierung","extern","Ja","Nein"]
[9821,"Obervellach","K","PLZ-Adressierung","extern","Ja","Ja"]
[9822,"Mallnitz","K","PLZ-Adressierung","extern","Ja","Nein"]
[9831,"Flattach","K","PLZ-Adressierung","extern","Ja","Nein"]
[9832,"Stall","K","PLZ-Adressierung","extern","Ja","Ja"]
[9833,"Rangersdorf","K","PLZ-Adressierung","extern","Ja","Nein"]
[9841,"Winklern","K","PLZ-Adressierung","extern","Ja","Ja"]
[9842,"Mörtschach","K","PLZ-Adressierung","extern","Ja","Nein"]
[9843,"Großkirchheim","K","PLZ-Adressierung","extern","Ja","Ja"]
[9844,"Heiligenblut","K","PLZ-Adressierung","extern","Ja","Nein"]
[9851,"Lieserbrücke","K","PLZ-Adressierung","extern","Ja","Nein"]
[9852,"Trebesing","K","PLZ-Adressierung","extern","Ja","Nein"]
[9853,"Gmünd","K","PLZ-Adressierung","extern","Ja","Ja"]
[9854,"Malta","K","PLZ-Adressierung","extern","Ja","Nein"]
[9861,"Eisentratten","K","PLZ-Adressierung","extern","Ja","Nein"]
[9862,"Kremsbrücke","K","PLZ-Adressierung","extern","Ja","Nein"]
[9863,"Rennweg","K","PLZ-Adressierung","extern","Ja","Ja"]
[9871,"Seeboden","K","PLZ-Adressierung","extern","Ja","Ja"]
[9872,"Millstatt","K","PLZ-Adressierung","extern","Ja","Ja"]
[9873,"Döbriach","K","PLZ-Adressierung","extern","Ja","Nein"]
[9900,"Lienz","T","PLZ-Adressierung","extern","Ja","Ja"]
[9904,"Thurn","T","PLZ-Adressierung","extern","Ja","Nein"]
[9911,"Assling","T","PLZ-Adressierung","extern","Ja","Ja"]
[9912,"Anras","T","PLZ-Adressierung","extern","Ja","Nein"]
[9913,"Abfaltersbach","T","PLZ-Adressierung","extern","Ja","Ja"]
[9920,"Sillian","T","PLZ-Adressierung","extern","Ja","Ja"]
[9931,"Außervillgraten","T","PLZ-Adressierung","extern","Ja","Nein"]
[9932,"Innervillgraten","T","PLZ-Adressierung","extern","Ja","Ja"]
[9941,"Kartitsch","T","PLZ-Adressierung","extern","Ja","Ja"]
[9942,"Obertilliach","T","PLZ-Adressierung","extern","Ja","Nein"]
[9943,"Untertilliach","T","PLZ-Adressierung","extern","Ja","Nein"]
[9951,"Ainet","T","PLZ-Adressierung","extern","Ja","Ja"]
[9953,"Huben","T","PLZ-Historisch","intern","Nein","Nein"]
[9954,"Schlaiten","T","PLZ-Adressierung","extern","Ja","Nein"]
[9961,"Hopfgarten in Defereggen","T","PLZ-Adressierung","extern","Ja","Nein"]
[9962,"St. Veit in Defereggen","T","PLZ-Adressierung","extern","Ja","Nein"]
[9963,"St. Jakob in Defereggen","T","PLZ-Adressierung","extern","Ja","Ja"]
[9971,"Matrei in Osttirol","T","PLZ-Adressierung","extern","Ja","Ja"]
[9972,"Virgen","T","PLZ-Adressierung","extern","Ja","Nein"]
[9974,"Prägraten","T","PLZ-Adressierung","extern","Ja","Nein"]
[9981,"Kals","T","PLZ-Adressierung","extern","Ja","Ja"]
[9990,"Nußdorf-Debant","T","PLZ-Adressierung","extern","Ja","Ja"]
[9991,"Dölsach","T","PLZ-Adressierung","extern","Ja","Nein"]

{"sheet":"Strompreis","index":9,"n_rows":126,"n_cols":87,"rows_kept":126,"cut":false,"hidden":true,"merged":[[0,4,0,20]]}
["Strompreisentwicklung am 17.03.09 ",null,null,null,"http://www.e-control.at/portal/page/portal/ECONTROL_HOME/STROM/STROMPREISE/ENDVERBRAUCHERPREISE"]
[]
[null,null,null,null,null,null,null,null,null,null,null,null,null,null,null,null,"Ökostrompreisentwicklung ( für Erzeuger) gemäß energie-Control vom 17.03.09"]
[]
[]
[]
[]
[]
[]
[]
[]
[]
[]
[]
[]
[]
[]
[]
[]
[]
[]
[]
[]
[]
[]
[]
[]
[]
[]
[]
[]
[]
[]
[]
["Abgerufen am 17.03.09 von http://www.oekostrom.at/default.asp?id=60837&tt=OEKOAG_R8&hl=3"]
["Der oekostrom®-Preis beträgt brutto 21,5 ct/kWh mit Preisgarantie bis 31.12.2010 und ist österreichweit einheitlich."]
["Für geschaltete Leistungen – Wärmepumpen, Warmwasserboiler, Nachtstrom – bieten wir unseren günstigen Tarif oekostrom®-click zu brutto 15,5, ct/kWh mit Preisgarantie bis 31.12.2010"]
[]
[null,"Jan. 02","2002-02-01","Mar.02","2002-04-01","May 02","2002-06-01","2002-07-01","2002-08-01","2002-09-01","Oct.02","2002-11-01","Dec.02","Jan. 03","2003-02-01","Mar.03","2003-04-01","May 03","2003-06-01","2003-07-01","2003-08-01","2003-09-01","Oct.03","2003-11-01","Dec.03","Jan. 04","2004-02-01","Mar.04","2004-04-01","May 04","2004-06-01","2004-07-01","2004-08-01","2004-09-01","Oct.04","2004-11-01","Dec. 04","Jan. 05","2005-02-01","Mar. 05","2005-04-01","May 05","June 05","July 05","2005-08-01","2005-09-01","Oct. 05","2005-11-01","Dec. 05","Jan 06","2006-02-01","Mar. 06","2006-04-01","May 06","2006-06-01","2006-07-01","2006-08-01","2006-09-01","Oct. 06","2006-11-01","Dec. 06","Jan. 07","2007-02-01","Mar. 07","2007-04-01","May  07","June 07","July 07","2007-08-01","2007-09-01","Oct. 07","2007-11-01","2007-12-01","Jan. 08","2008-02-01","March 08","2008-04-01","2008-05-01","2008-06-01","2008-07-01","2008-08-01","2008-09-01","2008-10-01","2008-11-01","2008-12-01","Jan. 09","2009-02-01"]
[null,"2002-01-01","2002-02-01","2002-03-01","2002-04-01","2002-05-01","2002-06-01","2002-07-01","2002-08-01","2002-09-01","2002-10-01","2002-11-01","2002-12-01","2003-01-01","2003-02-01","2003-03-01","2003-04-01","2003-05-01","2003-06-01","2003-07-01","2003-08-01","2003-09-01","2003-10-01","2003-11-01","2003-12-01","2004-01-01","2004-02-01","2004-03-01","2004-04-01","2004-05-01","2004-06-01","2004-07-01","2004-08-01","2004-09-01","2004-10-01","2004-11-01","2004-12-01","2005-01-01","2005-02-01","2005-03-01","2005-04-01","2005-05-01","2005-06-01","2005-07-01","2005-08-01","2005-09-01","2005-10-01","2005-11-01","2005-12-01","2006-01-01","2006-02-01","2006-03-01","2006-04-01","2006-05-01","2006-06-01","2006-07-01","2006-08-01","2006-09-01","2006-10-01","2006-11-01","2006-12-01","Jan 07","2007-02-01","2007-03-01","2007-04-01","2007-05-01","2007-06-01","2007-07-01","2007-08-01","2007-09-01","Oct. 07","2007-11-01","2007-12-01","Jan. 08","2008-02-01","2008-03-01","2008-04-01","2008-05-01","2008-06-01","2008-07-01","2008-08-01","2008-09-01","2008-10-01","2008-11-01","Dec. 08","Jan. 09","2009-02-01"]
["Stromnetz Steiermark GmbH",16.241714285714288,16.241714285714288,16.241714285714288,16.242171428571428,16.242171428571428,16.24182857142857,16.24182857142857,16.24182857142857,16.24182857142857,16.413257142857141,16.413257142857141,16.413257142857141,16.570971428571426,16.515085714285714,16.515085714285714,16.515085714285714,16.391657142857145,16.391657142857145,16.391657142857145,16.391657142857145,16.391657142857145,16.391657142857145,16.391657142857145,16.391657142857145,16.385828571428572,16.385828571428572,16.385828571428572,16.505485714285715,16.505485714285715,16.505485714285715,16.505485714285715,16.505485714285715,16.50582857142857,16.50582857142857,16.50582857142857,16.50582857142857,16.50582857142857,16.50582857142857,16.521257142857145,16.521257142857145,16.521257142857145,15.2508571428571,15.627428571428572,15.627428571428572,15.627428571428572,15.627428571428572,15.627428571428601,15.627428571428601,15.293428571428571,15.807771428571426,15.807771428571426,15.807771428571426,15.807771428571426,15.807771428571426,15.783428571428571,15.783428571428571,15.783428571428571,15.783428571428599,15.783428571428599,15.783428571428701,16.995999999999999,16.995999999999999,16.995999999999999,16.995999999999999,16.995999999999999,16.995999999999999,17,17,17,17,17,16.55,16.940000000000001,16.940000000000001,16.940000000000001,16.940000000000001,16.940000000000001,17.66,17.66,17.66,17.66,17.66,17.559999999999999,17.559999999999999,17.149999999999999,16.420000000000002]
["Energie AG",16.277142857142859,16.277142857142859,16.381142857142859,16.381028571428573,15.712800000000003,15.712800000000003,15.712800000000003,15.712800000000003,15.712800000000003,15.712800000000003,15.712800000000003,15.712800000000003,16.087542857142857,16.029600000000002,16.029600000000002,16.029600000000002,16.029600000000002,16.029600000000002,16.029600000000002,16.029600000000002,16.029600000000002,16.029600000000002,15.526285714285713,15.526285714285713,15.852000000000002,15.852000000000002,15.852000000000002,15.971657142857143,15.971657142857143,15.971657142857143,15.971657142857143,15.971657142857143,15.972,15.972,15.972,15.972,15.972,15.972,15.98742857142857,15.98742857142857,15.987428571428573,15.0394285714285,15.415885714285716,15.415885714285716,15.415885714285716,15.415885714285716,15.4158857142857,15.4158857142857,15.225714285714284,15.739885714285712,15.739885714285712,15.739885714285712,15.739885714285712,15.739885714285712,15.696,15.696,15.696,15.696,15.696,15.696,16.68542857142857,16.68542857142857,16.68542857142857,16.68542857142857,16.68542857142857,16.68542857142857,16.690000000000001,16.690000000000001,16.690000000000001,16.690000000000001,16.690000000000001,16.239999999999998,16.61,16.61,16.61,16.61,16.61,17.329999999999998,17.329999999999998,17.329999999999998,17.329999999999998,17.329999999999998,17.23,17.23,17.149999999999999,16.45]
["Salzburg AG",15.751714285714284,15.751714285714284,15.741142857142858,15.741257142857142,15.741257142857142,15.521485714285717,15.521485714285717,15.521485714285717,15.418285714285714,15.418285714285714,15.418285714285714,15.418285714285714,15.285257142857141,15.285257142857141,15.567428571428572,15.79337142857143,15.79337142857143,15.79337142857143,15.79337142857143,15.79337142857143,15.79337142857143,15.79337142857143,15.35417142857143,15.35417142857143,15.679885714285716,15.679885714285716,15.679885714285716,15.799542857142859,15.799542857142859,15.799542857142859,15.799542857142859,15.799542857142859,15.799885714285713,15.799885714285713,15.799885714285713,15.799885714285713,15.799885714285713,15.078171428571428,15.078171428571428,15.078171428571428,15.078171428571432,15.078171428571432,15.454628571428572,15.454628571428572,15.454628571428572,15.454628571428572,15.4546285714286,15.4546285714286,15.097142857142856,15.611314285714284,15.611314285714284,15.611314285714284,15.611314285714284,15.611314285714284,15.553714285714285,15.553714285714285,15.553714285714285,15.5537142857143,15.5537142857143,15.5537142857143,16.483428571428572,16.483428571428572,16.483428571428572,16.483428571428572,16.483428571428572,16.483428571428572,16.48,16.48,16.48,16.48,16.48,16.04,16.41,16.41,16.41,16.41,16.41,17.13,17.13,17.13,17.13,17.13,17.03,17.03,16.91,16.16]
["KELAG Netz",14.736857142857142,14.736857142857142,14.736857142857142,14.736685714285715,14.736685714285715,14.736685714285715,14.736685714285715,14.736685714285715,14.736685714285715,14.736685714285715,14.736685714285715,14.736685714285715,15.40217142857143,15.344228571428571,15.344228571428571,15.344228571428571,15.344228571428571,15.344228571428571,15.344228571428571,15.344228571428571,15.344228571428571,15.344228571428571,15.34937142857143,15.34937142857143,15.91954285714286,15.91954285714286,15.91954285714286,16.039200000000001,16.039200000000001,16.039200000000001,16.039200000000001,16.030285714285714,16.030628571428576,15.489942857142857,15.727885714285717,15.727885714285717,15.727885714285717,15.5214,15.215314285714287,15.256114285714288,15.256114285714288,15.256114285714288,15.125142857142857,15.125142857142857,15.125142857142857,15.125142857142857,15.125142857142899,15.125142857142899,15.003428571428572,15.517714285714286,15.517714285714286,15.517714285714286,15.517714285714286,15.517714285714286,15.476914285714287,15.476914285714287,15.476914285714287,15.476914285714299,15.476914285714299,15.476914285714299,16.722857142857141,16.722857142857141,16.722857142857141,16.722857142857141,16.722857142857141,16.722857142857141,16.72,16.72,16.72,16.72,16.72,16.28,16.739999999999998,16.739999999999998,16.739999999999998,16.739999999999998,16.739999999999998,17.46,17.46,17.46,17.46,17.46,17.350000000000001,17.350000000000001,17.46,16.7]
["BEWAG",17.002285714285716,17.002285714285716,17.002285714285716,15.988114285714287,15.988114285714287,15.988114285714287,15.988114285714287,16.333714285714283,16.333714285714283,16.333714285714283,16.333714285714283,16.333714285714283,16.576457142857144,16.518514285714286,16.518514285714286,16.518514285714286,16.518514285714286,16.518514285714286,16.518514285714286,16.518514285714286,16.518514285714286,16.518514285714286,15.919885714285716,15.919885714285716,16.434857142857144,16.434857142857144,16.434857142857144,16.554514285714287,16.554514285714287,16.554514285714287,16.554514285714287,16.554514285714287,16.554857142857141,16.554857142857141,16.554857142857141,16.554857142857141,16.554857142857141,14.692457142857142,14.692457142857142,14.692457142857142,14.692457142857142,14.692457142857142,15.068914285714287,15.068914285714287,15.068914285714287,15.068914285714287,15.0689142857143,15.0689142857143,14.731999999999999,15.246514285714284,15.246514285714284,15.246514285714284,15.246514285714284,15.246514285714284,15.135771428571427,15.135771428571427,15.135771428571427,15.135771428571401,15.135771428571401,15.135771428571299,16.192571428571426,16.192571428571426,16.192571428571426,16.192571428571426,16.192571428571426,16.192571428571426,16.190000000000001,16.190000000000001,16.190000000000001,16.190000000000001,16.190000000000001,15.75,16.14,16.14,16.14,16.14,16.14,16.86,16.86,16.86,16.86,16.86,16.86,16.940000000000001,16.850000000000001,16.850000000000001]
["Linz Strom",15.44,15.543714285714286,15.543714285714286,15.54377142857143,14.705142857142855,14.705142857142855,14.705142857142855,14.705142857142855,14.705142857142855,14.705142857142855,14.705142857142855,14.705142857142855,15.079885714285716,15.021942857142857,15.021942857142857,15.021942857142857,15.021942857142857,15.021942857142857,15.021942857142857,15.021942857142857,15.021942857142857,15.021942857142857,14.771314285714285,14.771314285714285,15.179314285714284,15.179314285714284,15.179314285714284,15.298971428571431,15.298971428571431,15.298971428571431,15.298971428571431,15.298971428571431,15.299314285714285,15.299314285714285,15.299314285714285,15.299314285714285,15.299314285714285,15.299314285714285,15.314742857142859,15.314742857142859,15.314742857142855,14.376571428571401,14.753142857142857,14.753142857142857,14.753142857142857,14.753142857142857,14.753142857142899,14.753142857142899,14.407999999999999,15.016114285714288,15.016114285714288,15.016114285714288,15.016114285714288,15.016114285714288,14.996571428571432,14.996571428571432,14.996571428571432,14.9965714285714,14.9965714285714,14.996571428571301,16.126000000000001,16.126000000000001,16.126000000000001,16.126000000000001,16.126000000000001,16.126000000000001,16.13,16.13,16.13,16.13,16.13,15.68,15.92,15.92,15.92,15.92,15.92,16.64,16.64,16.64,16.64,16.64,16.54,16.54,16.29,15.51]
["VKW",12.881428571428572,12.881428571428572,12.881714285714287,12.881828571428573,12.881828571428573,12.881828571428573,12.768000000000001,12.768000000000001,12.804342857142855,12.804342857142855,12.804342857142855,12.804342857142855,13.214057142857142,13.104685714285713,13.104685714285713,13.104685714285713,13.104685714285713,13.104685714285713,13.104685714285713,13.104685714285713,13.104685714285713,13.104685714285713,13.120114285714285,13.120114285714285,13.74,13.74,13.74,13.859657142857142,13.859657142857142,13.859657142857142,13.859657142857142,13.859657142857142,13.86,13.86,13.86,13.86,13.86,13.86,13.875428571428571,13.394400000000001,13.394400000000001,13.394400000000001,13.469828571428572,13.469828571428572,13.469828571428572,13.469828571428572,13.4698285714286,13.4698285714286,14.196,14.710285714285714,14.710285714285714,14.710285714285714,14.710285714285714,14.710285714285714,14.684228571428575,14.684228571428575,14.684228571428575,14.6842285714286,14.6842285714286,14.6842285714286,16.033714285714286,16.033714285714286,16.033714285714286,16.033714285714286,16.033714285714286,16.033714285714286,16.03,16.03,16.03,16.03,16.03,15.59,16.02,16.02,16.02,16.02,16.02,16.739999999999998,16.739999999999998,16.739999999999998,16.739999999999998,16.739999999999998,16.64,16.64,16.71,15.92]
["EVN",14.325428571428571,14.325428571428571,14.325714285714286,14.3256,14.3256,13.985828571428572,13.985828571428572,13.985828571428572,14.069828571428571,14.069828571428571,14.069828571428571,14.069828571428571,14.516571428571428,14.458628571428571,14.458628571428571,14.458628571428571,14.458628571428571,14.458628571428571,14.458628571428571,14.458628571428571,14.458628571428571,14.458628571428571,14.042057142857146,14.042057142857146,14.36777142857143,14.36777142857143,14.36777142857143,14.487428571428572,14.487428571428572,14.487428571428572,14.487428571428572,14.487428571428572,14.487771428571429,14.487771428571429,14.487771428571429,14.487771428571429,14.487771428571429,14.487771428571429,14.5032,13.947771428571428,13.947771428571428,13.947771428571428,14.32422857142857,14.32422857142857,14.32422857142857,14.32422857142857,14.3242285714286,14.3242285714286,14.154857142857143,14.790514285714286,14.790514285714286,14.790514285714286,14.790514285714286,14.790514285714286,14.73942857142857,14.73942857142857,14.73942857142857,14.739428571428601,14.739428571428601,14.7394285714287,15.859142857142858,15.859142857142858,15.859142857142858,15.859142857142858,15.859142857142858,15.859142857142858,15.86,15.86,15.86,15.86,15.86,15.41,15.8,15.8,15.8,15.8,15.8,16.52,16.52,16.52,16.52,16.52,16.600000000000001,16.690000000000001,16.75,16.75]
["Wien Energie Stromnetz GmbH",14.756571428571428,14.756571428571428,14.756571428571428,14.091085714285715,14.091085714285715,14.091085714285715,14.091085714285715,14.091085714285715,14.090742857142859,14.090742857142859,14.090742857142859,14.090742857142859,13.763657142857145,13.705714285714285,13.705714285714285,13.705714285714285,13.705714285714285,13.705714285714285,13.705714285714285,13.705714285714285,13.705714285714285,13.705714285714285,13.377600000000001,13.377600000000001,13.703314285714288,13.703314285714288,13.703314285714288,13.822971428571432,13.822971428571432,13.822971428571432,13.822971428571432,13.822971428571432,13.823314285714286,13.823314285714286,13.823314285714286,13.823314285714286,13.823314285714286,13.823314285714286,13.838742857142856,13.337485714285714,13.337485714285714,13.337485714285714,13.713942857142856,13.713942857142856,13.713942857142856,13.713942857142856,13.7139428571429,13.7139428571429,13.675714285714285,14.189828571428572,14.189828571428572,14.189828571428572,14.189828571428572,14.189828571428572,14.12777142857143,14.12777142857143,14.12777142857143,14.1277714285714,14.1277714285714,14.1277714285713,15.321142857142858,15.321142857142858,15.321142857142858,15.321142857142858,15.321142857142858,15.321142857142858,15.32,15.32,15.32,15.32,15.32,14.89,15.5,15.5,15.5,15.5,15.5,16.22,16.22,16.22,16.22,16.22,16.3,16.3,16.399999999999999,16.579999999999998]
["Stromnetz Graz GmbH & Co KG",14.264857142857142,14.264857142857142,14.264857142857142,14.265257142857143,14.265257142857143,14.265257142857143,14.265257142857143,14.265257142857143,14.265257142857143,14.436685714285714,14.436685714285714,14.436685714285714,14.596457142857142,14.538514285714285,14.538514285714285,14.538514285714285,14.538514285714285,14.538514285714285,14.538514285714285,14.538514285714285,14.538514285714285,14.538514285714285,14.538514285714285,14.538514285714285,14.113714285714286,14.113714285714286,14.113714285714286,14.233371428571429,14.233371428571429,14.233371428571429,14.233371428571429,14.233371428571429,14.233714285714285,14.233714285714285,14.233714285714285,14.233714285714285,14.233714285714285,14.233714285714285,14.249142857142857,14.249142857142857,14.249142857142857,13.3762857142857,13.752685714285715,13.752685714285715,13.752685714285715,13.752685714285715,13.7526857142857,13.7526857142857,13.483428571428572,13.99782857142857,13.99782857142857,13.99782857142857,13.99782857142857,13.99782857142857,13.961828571428571,13.961828571428571,13.961828571428571,13.961828571428599,13.961828571428599,13.9618285714287,15.061428571428571,15.061428571428571,15.061428571428571,15.061428571428571,15.061428571428571,15.061428571428571,15.06,15.06,15.06,15.06,15.06,14.62,14.93,14.93,14.93,14.93,14.93,15.65,15.65,15.65,15.65,15.65,15.55,15.55,15.49,14.83]
["Tiwag",12.683714285714286,12.683714285714286,12.683714285714286,12.683657142857143,12.683657142857143,12.683657142857143,12.683657142857143,12.683657142857143,12.683657142857143,12.57737142857143,12.57737142857143,12.57737142857143,13.132114285714286,13.074171428571429,13.074171428571429,13.074171428571429,13.074171428571429,13.074171428571429,13.074171428571429,13.074171428571429,13.074171428571429,13.074171428571429,12.457714285714285,12.457714285714285,13.770857142857144,13.770857142857144,13.770857142857144,13.890514285714286,13.890514285714286,13.890514285714286,13.890514285714286,13.890514285714286,13.890857142857143,13.890857142857143,13.890857142857143,13.823657142857144,13.823657142857144,13.823657142857144,13.906285714285715,13.521942857142855,13.521942857142855,13.521942857142855,13.898399999999999,13.898399999999999,13.898399999999999,13.898399999999999,13.898400000000001,13.898400000000001,13.467428571428572,13.981714285714286,13.981714285714286,13.981714285714286,13.981714285714286,13.981714285714286,13.497942857142856,13.497942857142856,13.497942857142856,13.497942857142901,13.497942857142901,13.497942857143,15.276,15.276,15.276,15.276,15.276,15.276,15.28,15.28,15.28,15.28,15.28,14.83,15.28,15.28,15.28,15.28,15.28,15.8,15.8,15.8,15.8,15.8,15.8,15.8,15.9,15.2]
["IKB",12.692285714285715,12.692285714285715,12.692285714285715,12.692228571428572,12.692228571428572,12.692228571428572,12.692228571428572,12.692228571428572,12.692228571428572,12.40457142857143,12.40457142857143,12.40457142857143,12.918171428571428,13.052914285714285,13.052914285714285,13.052914285714285,13.052914285714285,13.052914285714285,13.052914285714285,13.052914285714285,13.052914285714285,13.052914285714285,12.793028571428573,12.793028571428573,13.118742857142859,13.119085714285715,13.119085714285715,13.238742857142856,13.238742857142856,13.238742857142856,13.238742857142856,13.238742857142856,13.239085714285716,13.171885714285716,13.171885714285716,13.171885714285716,13.171885714285716,13.171885714285716,13.254514285714286,12.892457142857143,12.892457142857143,12.892457142857143,13.515085714285714,13.515085714285714,13.515085714285714,13.515085714285714,13.5150857142857,13.5150857142857,13.324,13.508914285714287,13.508914285714287,13.508914285714287,13.508914285714287,13.508914285714287,13.962514285714285,13.962514285714285,13.962514285714285,13.962514285714301,13.962514285714301,13.962514285714301,14.77,14.77,14.77,14.77,14.77,14.77,14.77,14.77,14.77,14.77,14.77,14.33,14.69,14.69,14.69,14.69,14.69,15.41,15.41,15.41,15.41,15.41,15.49,15.49,15.53,16.05]
["Energie Klagenfurt GmbH",12.483428571428572,12.483428571428572,12.483428571428572,12.483428571428572,12.483428571428572,12.483428571428572,12.483428571428572,12.483428571428572,12.483428571428572,12.534514285714286,12.534514285714286,12.534514285714286,13.038514285714285,12.980571428571428,12.980571428571428,12.980571428571428,12.980571428571428,12.980571428571428,12.980571428571428,12.980571428571428,12.980571428571428,12.980571428571428,12.615428571428572,12.615428571428572,12.941142857142857,12.941142857142857,12.941142857142857,13.0608,13.0608,13.0608,13.0608,13.0608,13.061142857142856,12.993942857142857,12.993942857142857,12.993942857142857,12.993942857142857,12.652799999999999,12.652799999999999,12.652799999999999,12.652799999999999,12.652799999999999,13.029257142857142,13.029257142857142,13.029257142857142,13.029257142857142,13.0292571428571,13.0292571428571,12.919714285714285,13.43382857142857,13.43382857142857,13.43382857142857,13.43382857142857,13.43382857142857,13.402285714285714,13.402285714285714,13.402285714285714,13.4022857142857,13.4022857142857,13.4022857142857,13.89,13.89,13.89,13.89,13.89,13.89,13.89,13.89,13.89,13.89,13.89,13.44,13.77,13.77,13.77,13.77,13.77,14.49,14.49,14.49,14.49,14.49,14.57,14.57,14.76,14.76]
["STEG",15.605142857142855,15.605142857142855,15.605142857142855,15.605485714285715,15.605485714285715,15.605485714285715,15.605485714285715,15.605485714285715,15.605142857142855,15.776571428571428,15.776571428571428,15.776571428571428,15.936342857142856,15.878400000000001,15.878400000000001,15.878400000000001,15.878400000000001,15.878400000000001,15.878400000000001,15.878400000000001,15.878400000000001,15.878400000000001,15.878400000000001,15.878400000000001]
[null,{"$f":"AVERAGE(B41:B54)","v":14.653040816326527},14.660448979591834,14.667163265306119,14.547257142857145,14.43962448979592,14.399632653061227,14.391502040816325,14.41618775510204,14.417363265306124,14.429608163265311,14.429608163265311,14.429608163265311,14.722726530612245,14.679159183673468,14.699314285714285,14.71545306122449,14.706636734693877,14.706636734693877,14.706636734693877,14.706636734693877,14.706636734693877,14.706636734693877,14.438253061224488,14.438253061224488,14.708228571428574,14.708254945054948,14.708254945054948,14.827912087912088,14.827912087912088,14.827912087912088,14.827912087912088,14.827226373626372,{"$f":"AVERAGE(AH41:AH54)","v":14.827569230769235},14.77563956043956,14.793942857142856,14.788773626373626,14.788773626373626,14.547870329670328,14.545345054945056,14.372782417582417,14.372782417582417,14.062826373626361,14.396043956043957,14.396043956043957,14.396043956043957,14.396043956043957,14.396043956043968,14.396043956043968,14.229296703296702,14.734786813186812,14.734786813186812,14.734786813186812,14.734786813186812,14.734786813186812,14.693723076923078,14.693723076923078,14.693723076923078,14.693723076923087,14.693723076923087,14.69372307692309,15.801362637362637,15.801362637362637,15.801362637362637,15.801362637362637,{"$f":"AVERAGE(BN41:BN54)","v":15.801362637362637},15.801362637362637,15.801538461538463,15.801538461538463,15.801538461538463,15.801538461538463,15.801538461538463,15.357692307692311,15.75,15.75,15.75,15.75,15.75,16.454615384615384,16.454615384615384,16.454615384615384,16.454615384615384,16.454615384615384,16.424615384615386,16.437692307692313,16.411538461538463,16.013846153846156]
[]
[]
[]
[]
[]
[]
[]
[]
[]
[]
[]
[]
[]
[]
[]
[]
[]
[]
[]
[]
[]
[]
[]
[]
[]
[]
[]
[]
[]
[]
[]
[]
[]
[]
[]
[]
[]
[]
[null,"Derzeit durchschnittlicher Strompreis:",null,null,null,null,{"$f":"CI55","v":16.013846153846156},"cent/kWh"]
[null,"Derzeit Ökostrompreis (ökostrom-ag):",null,null,null,null,21.5,"cent/kWh"]
[null,"Einspeisepreis für Ökostrom:",null,null,null,null,5.59,"cent/kWh"]
[]
[]
[]
[]
[]
[{"$f":"$B$55*(1+(D102/100))^7","v":16.26260280854213},null,null,1.5]
[{"$f":"Eingabe!#REF!*(1+(Eingabe!$G$75/100))^Berechnungen!#REF!","v":{"$error":"#REF!"}}]
[{"$f":"Eingabe!#REF!*(1+(Eingabe!$G$75/100))^Berechnungen!#REF!","v":{"$error":"#REF!"}}]
[{"$f":"Eingabe!#REF!*(1+(Eingabe!$G$75/100))^Berechnungen!#REF!","v":{"$error":"#REF!"}}]
[{"$f":"Eingabe!#REF!*(1+(Eingabe!$G$75/100))^Berechnungen!#REF!","v":{"$error":"#REF!"}}]
[{"$f":"Eingabe!#REF!*(1+(Eingabe!$G$75/100))^Berechnungen!#REF!","v":{"$error":"#REF!"}}]
[{"$f":"Eingabe!#REF!*(1+(Eingabe!$G$75/100))^Berechnungen!#REF!","v":{"$error":"#REF!"}}]
[{"$f":"Eingabe!#REF!*(1+(Eingabe!$G$75/100))^Berechnungen!#REF!","v":{"$error":"#REF!"}}]
[{"$f":"Eingabe!#REF!*(1+(Eingabe!$G$75/100))^Berechnungen!#REF!","v":{"$error":"#REF!"}}]
[{"$f":"Eingabe!#REF!*(1+(Eingabe!$G$75/100))^Berechnungen!#REF!","v":{"$error":"#REF!"}}]
[{"$f":"Eingabe!#REF!*(1+(Eingabe!$G$75/100))^Berechnungen!#REF!","v":{"$error":"#REF!"}}]
[{"$f":"Eingabe!#REF!*(1+(Eingabe!$G$75/100))^Berechnungen!#REF!","v":{"$error":"#REF!"}}]
[{"$f":"Eingabe!#REF!*(1+(Eingabe!$G$75/100))^Berechnungen!#REF!","v":{"$error":"#REF!"}}]
[{"$f":"Eingabe!#REF!*(1+(Eingabe!$G$75/100))^Berechnungen!#REF!","v":{"$error":"#REF!"}}]
[{"$f":"Eingabe!#REF!*(1+(Eingabe!$G$75/100))^Berechnungen!#REF!","v":{"$error":"#REF!"}}]
[{"$f":"Eingabe!#REF!*(1+(Eingabe!$G$75/100))^Berechnungen!#REF!","v":{"$error":"#REF!"}}]
[{"$f":"Eingabe!#REF!*(1+(Eingabe!$G$75/100))^Berechnungen!#REF!","v":{"$error":"#REF!"}}]
[{"$f":"Eingabe!#REF!*(1+(Eingabe!$G$75/100))^Berechnungen!#REF!","v":{"$error":"#REF!"}}]
[{"$f":"Eingabe!#REF!*(1+(Eingabe!$G$75/100))^Berechnungen!#REF!","v":{"$error":"#REF!"}}]
[{"$f":"Eingabe!#REF!*(1+(Eingabe!$G$75/100))^Berechnungen!#REF!","v":{"$error":"#REF!"}}]
[{"$f":"Eingabe!#REF!*(1+(Eingabe!$G$75/100))^Berechnungen!#REF!","v":{"$error":"#REF!"}}]
[{"$f":"Eingabe!#REF!*(1+(Eingabe!$G$75/100))^Berechnungen!#REF!","v":{"$error":"#REF!"}}]
[{"$f":"Eingabe!#REF!*(1+(Eingabe!$G$75/100))^Berechnungen!#REF!","v":{"$error":"#REF!"}}]
[{"$f":"Eingabe!#REF!*(1+(Eingabe!$G$75/100))^Berechnungen!#REF!","v":{"$error":"#REF!"}}]
[{"$f":"Eingabe!#REF!*(1+(Eingabe!$G$75/100))^Berechnungen!#REF!","v":{"$error":"#REF!"}}]

{"sheet":"Motorbez. Versicherungssteuer","index":10,"n_rows":509,"n_cols":22,"rows_kept":509,"cut":false,"hidden":true,"merged":[[6,6,6,9],[7,6,7,9],[6,2,6,5],[7,2,7,5],[0,11,0,15],[0,4,0,7],[0,0,0,2],[1,4,1,7]]}
["Berechung NEU",null,null,null,"Motorbezogene Versicherungssteuer NEU",null,null,null,null,null,null,"Werte ab 01.10.2020",null,null,null,null,null,"Jahr",null,"Jahr der Anschaffung","CO2 Grenzwert","Leistung Grenzwert"]
["jährliche",null,{"$f":"(IF((Eingabe!M17-$O$5)>5,(Eingabe!M17-$O$5)*$M$5,5*$M$5)+IF((Eingabe!M22-$O$3)>5,(Eingabe!M22-$O$3)*$M$3,5*$M$3))*12","v":509.76000000000005},null,{"$f":"VLOOKUP(Eingabe!C46,'Motorbez. Versicherungssteuer'!A2:C5,3,FALSE)","v":509.76000000000005},null,null,null,null,null,null,null,null,null,null,null,null,null,null,"[a]","[g/km]","[kW]"]
["½-jährliche",null,{"$f":"(IF((Eingabe!M17-$O$5)>5,(Eingabe!M17-$O$5)*$M$5,5*$M$5)+IF((Eingabe!M22-$O$3)>5,(Eingabe!M22-$O$3)*$M$3,5*$M$3))*6","v":254.88000000000002},null,null,null,null,null,null,null,null,"CO2",0.72,"€ pro g/km ab",{"$f":"VLOOKUP(R3,T3:V7,2,TRUE)","v":115},"g/km",null,2020,null,2020,115,65]
["¼-jährliche",null,{"$f":"(IF((Eingabe!M17-$O$5)>5,(Eingabe!M17-$O$5)*$M$5,5*$M$5)+IF((Eingabe!M22-$O$3)>5,(Eingabe!M22-$O$3)*$M$3,5*$M$3))*3","v":127.44000000000001},null,null,null,null,null,null,null,null,null,null,null,null,null,null,null,null,2021,112,64]
["monatliche",null,{"$f":"(IF((Eingabe!M17-$O$5)>5,(Eingabe!M17-$O$5)*$M$5,5*$M$5)+IF((Eingabe!M22-$O$3)>5,(Eingabe!M22-$O$3)*$M$3,5*$M$3))","v":42.480000000000004},null,null,null,null,null,null,null,null,"Leistung",0.72,"€ pro kW ab ",{"$f":"VLOOKUP(R3,T3:V7,3,TRUE)","v":65},"kW",null,null,null,2022,109,63]
[null,null,null,null,null,null,null,null,null,null,null,null,null,null,null,null,null,null,null,2023,106,62]
["Leistung","Staffelung","Motorbezogene Versicherungssteuer (spezifisch)",null,null,null,"Absolutbeträge",null,null,null,null,null,null,null,null,null,null,null,null,2024,103,61]
["[kW]",null,"[€/kW und Monat]",null,null,null,"[€/a]"]
[null,null,"jährliche","½-jährliche","¼-jährliche","monatliche","jährliche","½-jährliche","¼-jährliche","monatliche"]
[1,1,0,0,0,0,{"$f":"C10*A10*12","v":0},{"$f":"D10*B10*12","v":0},0,0]
[2,2,0,0,0,0,{"$f":"C11*A11*12","v":0},0,0,0]
[3,3,0,0,0,0,0,0,0,0]
[4,4,0,0,0,0,0,0,0,0]
[5,5,0,0,0,0,0,0,0,0]
[6,6,0,0,0,0,0,0,0,0]
[7,7,0,0,0,0,0,0,0,0]
[8,8,0,0,0,0,0,0,0,0]
[9,9,0,0,0,0,0,0,0,0]
[10,10,0,0,0,0,0,0,0,0]
[11,11,0,0,0,0,0,0,0,0]
[12,12,0,0,0,0,0,0,0,0]
[13,13,0,0,0,0,0,0,0,0]
[14,14,0,0,0,0,0,0,0,0]
[15,15,0,0,0,0,0,0,0,0]
[16,16,0,0,0,0,0,0,0,0]
[17,17,0,0,0,0,0,{"$f":"D26*B26*12","v":0},{"$f":"E26*C26*12","v":0},{"$f":"F26*D26*12","v":0}]
[18,18,0,0,0,0,0,0,0,0]
[19,19,0,0,0,0,0,0,0,0]
[20,20,0,0,0,0,0,0,0,0]
[21,21,0,0,0,0,0,0,0,0]
[22,22,0,0,0,0,0,0,0,0]
[23,23,0,0,0,0,0,0,0,0]
[24,24,0,0,0,0,0,0,0,0]
[25,1,0.62,0.65720000000000001,0.66959999999999997,0.68200000000000005,{"$f":"C34*$B34*12","v":7.4399999999999995},{"$f":"D34*$B34*12","v":7.8864000000000001},8.0351999999999997,8.1840000000000011]
[26,2,0.62,0.65720000000000001,0.66959999999999997,0.68200000000000005,{"$f":"C35*$B35*12","v":14.879999999999999},15.7728,16.070399999999999,16.368000000000002]
[27,3,0.62,0.65720000000000001,0.66959999999999997,0.68200000000000005,22.32,23.659199999999998,24.105599999999999,24.552000000000003]
[28,4,0.62,0.65720000000000001,0.66959999999999997,0.68200000000000005,29.759999999999998,31.5456,32.140799999999999,32.736000000000004]
[29,5,0.62,0.65720000000000001,0.66959999999999997,0.68200000000000005,37.200000000000003,39.432000000000002,40.176000000000002,40.92]
[30,6,0.62,0.65720000000000001,0.66959999999999997,0.68200000000000005,44.64,47.318399999999997,48.211199999999998,49.104000000000006]
[31,7,0.62,0.65720000000000001,0.66959999999999997,0.68200000000000005,52.08,55.204800000000006,56.246399999999994,57.287999999999997]
[32,8,0.62,0.65720000000000001,0.66959999999999997,0.68200000000000005,59.519999999999996,63.091200000000001,64.281599999999997,65.472000000000008]
[33,9,0.62,0.65720000000000001,0.66959999999999997,0.68200000000000005,66.960000000000008,70.977599999999995,72.316800000000001,73.656000000000006]
[34,10,0.62,0.65720000000000001,0.66959999999999997,0.68200000000000005,74.400000000000006,78.864000000000004,80.352000000000004,81.84]
[35,11,0.62,0.65720000000000001,0.66959999999999997,0.68200000000000005,81.84,86.750400000000013,88.387199999999993,90.024000000000001]
[36,12,0.62,0.65720000000000001,0.66959999999999997,0.68200000000000005,89.28,94.636799999999994,96.422399999999996,98.208000000000013]
[37,13,0.62,0.65720000000000001,0.66959999999999997,0.68200000000000005,96.72,102.5232,104.45759999999999,106.39200000000002]
[38,14,0.62,0.65720000000000001,0.66959999999999997,0.68200000000000005,104.16,110.40960000000001,112.49279999999999,114.57599999999999]
[39,15,0.62,0.65720000000000001,0.66959999999999997,0.68200000000000005,111.60000000000001,118.29600000000001,120.52800000000001,122.76]
[40,16,0.62,0.65720000000000001,0.66959999999999997,0.68200000000000005,119.03999999999999,126.1824,128.56319999999999,130.94400000000002]
[41,17,0.62,0.65720000000000001,0.66959999999999997,0.68200000000000005,126.47999999999999,{"$f":"D50*$B50*12","v":134.06880000000001},{"$f":"E50*$B50*12","v":136.59839999999997},{"$f":"F50*$B50*12","v":139.12800000000001}]
[42,18,0.62,0.65720000000000001,0.66959999999999997,0.68200000000000005,133.92000000000002,141.95519999999999,144.6336,147.31200000000001]
[43,19,0.62,0.65720000000000001,0.66959999999999997,0.68200000000000005,141.35999999999999,149.8416,152.6688,155.49600000000001]
[44,20,0.62,0.65720000000000001,0.66959999999999997,0.68200000000000005,148.80000000000001,157.72800000000001,160.70400000000001,163.68]
[45,21,0.62,0.65720000000000001,0.66959999999999997,0.68200000000000005,156.24,165.61439999999999,168.73919999999998,171.864]
[46,22,0.62,0.65720000000000001,0.66959999999999997,0.68200000000000005,163.68,173.50080000000003,176.77439999999999,180.048]
[47,23,0.62,0.65720000000000001,0.66959999999999997,0.68200000000000005,171.12,181.38720000000001,184.80959999999999,188.23200000000003]
[48,24,0.62,0.65720000000000001,0.66959999999999997,0.68200000000000005,178.56,189.27359999999999,192.84479999999999,196.41600000000003]
[49,25,0.62,0.65720000000000001,0.66959999999999997,0.68200000000000005,186,197.16,200.88,204.60000000000002]
[50,26,0.62,0.65720000000000001,0.66959999999999997,0.68200000000000005,193.44,205.04640000000001,208.91519999999997,212.78400000000005]
[51,27,0.62,0.65720000000000001,0.66959999999999997,0.68200000000000005,200.88,212.93279999999999,216.9504,220.96800000000002]
[52,28,0.62,0.65720000000000001,0.66959999999999997,0.68200000000000005,208.32,220.81920000000002,224.98559999999998,229.15199999999999]
[53,29,0.62,0.65720000000000001,0.66959999999999997,0.68200000000000005,215.76,228.7056,233.02079999999998,237.33600000000001]
[54,30,0.62,0.65720000000000001,0.66959999999999997,0.68200000000000005,223.20000000000002,236.59200000000001,241.05600000000001,245.52]
[55,31,0.62,0.65720000000000001,0.66959999999999997,0.68200000000000005,230.64,244.47840000000002,249.09120000000001,253.70400000000004]
[56,32,0.62,0.65720000000000001,0.66959999999999997,0.68200000000000005,238.07999999999998,252.3648,257.12639999999999,261.88800000000003]
[57,33,0.62,0.65720000000000001,0.66959999999999997,0.68200000000000005,245.52,260.25119999999998,265.16159999999996,270.072]
[58,34,0.62,0.65720000000000001,0.66959999999999997,0.68200000000000005,252.95999999999998,268.13760000000002,273.19679999999994,278.25600000000003]
[59,35,0.62,0.65720000000000001,0.66959999999999997,0.68200000000000005,260.39999999999998,276.024,281.23199999999997,286.44]
[60,36,0.62,0.65720000000000001,0.66959999999999997,0.68200000000000005,267.84000000000003,283.91039999999998,289.2672,294.62400000000002]
[61,37,0.62,0.65720000000000001,0.66959999999999997,0.68200000000000005,275.28000000000003,291.79680000000002,297.30239999999998,302.80799999999999]
[62,38,0.62,0.65720000000000001,0.66959999999999997,0.68200000000000005,282.71999999999997,299.6832,305.33760000000001,310.99200000000002]
[63,39,0.62,0.65720000000000001,0.66959999999999997,0.68200000000000005,290.15999999999997,307.56960000000004,313.37279999999998,319.17600000000004]
[64,40,0.62,0.65720000000000001,0.66959999999999997,0.68200000000000005,297.60000000000002,315.45600000000002,321.40800000000002,327.36]
[65,41,0.62,0.65720000000000001,0.66959999999999997,0.68200000000000005,305.03999999999996,323.3424,329.44319999999999,335.54400000000004]
[66,42,0.62,0.65720000000000001,0.66959999999999997,0.68200000000000005,312.48,331.22879999999998,337.47839999999997,343.72800000000001]
[67,43,0.62,0.65720000000000001,0.66959999999999997,0.68200000000000005,319.92,339.11519999999996,345.5136,351.91200000000003]
[68,44,0.62,0.65720000000000001,0.66959999999999997,0.68200000000000005,327.36,347.00160000000005,353.54879999999997,360.096]
[69,45,0.62,0.65720000000000001,0.66959999999999997,0.68200000000000005,334.79999999999995,354.88800000000003,361.58399999999995,368.28000000000003]
[70,46,0.62,0.65720000000000001,0.66959999999999997,0.68200000000000005,342.24,362.77440000000001,369.61919999999998,376.46400000000006]
[71,47,0.62,0.65720000000000001,0.66959999999999997,0.68200000000000005,349.68,370.66079999999999,377.65440000000001,384.64800000000002]
[72,48,0.62,0.65720000000000001,0.66959999999999997,0.68200000000000005,357.12,378.54719999999998,385.68959999999998,392.83200000000005]
[73,49,0.62,0.65720000000000001,0.66959999999999997,0.68200000000000005,364.56,386.43360000000007,393.72480000000002,401.01599999999996]
[74,50,0.62,0.65720000000000001,0.66959999999999997,0.68200000000000005,372,394.32,401.76,409.20000000000005]
[75,51,0.62,0.65720000000000001,0.66959999999999997,0.68200000000000005,379.44,402.20640000000003,409.79520000000002,417.38400000000001]
[76,52,0.62,0.65720000000000001,0.66959999999999997,0.68200000000000005,386.88,410.09280000000001,417.83039999999994,425.5680000000001]
[77,53,0.62,0.65720000000000001,0.66959999999999997,0.68200000000000005,394.32,417.97919999999999,425.86559999999997,433.75200000000001]
[78,54,0.62,0.65720000000000001,0.66959999999999997,0.68200000000000005,401.76,425.86559999999997,433.9008,441.93600000000004]
[79,55,0.62,0.65720000000000001,0.66959999999999997,0.68200000000000005,409.20000000000005,433.75200000000001,441.93599999999992,450.12000000000006]
[80,56,0.62,0.65720000000000001,0.66959999999999997,0.68200000000000005,416.64,441.63840000000005,449.97119999999995,458.30399999999997]
[81,57,0.62,0.65720000000000001,0.66959999999999997,0.68200000000000005,424.07999999999993,449.52480000000003,458.00639999999999,466.48800000000006]
[82,58,0.62,0.65720000000000001,0.66959999999999997,0.68200000000000005,431.52,457.41120000000001,466.04159999999996,474.67200000000003]
[83,59,0.62,0.65720000000000001,0.66959999999999997,0.68200000000000005,438.96,465.29759999999999,474.07679999999999,482.85599999999999]
[84,60,0.62,0.65720000000000001,0.66959999999999997,0.68200000000000005,446.40000000000003,473.18400000000003,482.11200000000002,491.04]
[85,61,0.62,0.65720000000000001,0.66959999999999997,0.68200000000000005,453.84000000000003,481.07039999999995,490.1472,499.22400000000005]
[86,62,0.62,0.65720000000000001,0.66959999999999997,0.68200000000000005,461.28,488.95680000000004,498.18240000000003,507.40800000000007]
[87,63,0.62,0.65720000000000001,0.66959999999999997,0.68200000000000005,468.72,496.84319999999997,506.21759999999995,515.59199999999998]
[88,64,0.62,0.65720000000000001,0.66959999999999997,0.68200000000000005,476.15999999999997,504.7296,514.25279999999998,523.77600000000007]
[89,65,0.62,0.65720000000000001,0.66959999999999997,0.68200000000000005,483.59999999999997,512.61599999999999,522.28800000000001,531.96]
[90,66,0.62,0.65720000000000001,0.66959999999999997,0.68200000000000005,{"$f":"C99*$B99*12","v":491.04},520.50239999999997,530.32319999999993,540.14400000000001]
[91,1,0.66,0.6996,0.71279999999999999,0.72599999999999998,{"$f":"G$99+C100*$B100*12","v":498.96000000000004},{"$f":"H$99+D100*$B100*12","v":528.89760000000001},538.87679999999989,548.85599999999999]
[92,2,0.66,0.6996,0.71279999999999999,0.72599999999999998,{"$f":"G$99+C101*$B101*12","v":506.88},537.29279999999994,547.43039999999996,557.56799999999998]
[93,3,0.66,0.6996,0.71279999999999999,0.72599999999999998,514.80000000000007,545.68799999999999,555.98399999999992,566.28]
[94,4,0.66,0.6996,0.71279999999999999,0.72599999999999998,522.72,554.08319999999992,564.53759999999988,574.99199999999996]
[95,5,0.66,0.6996,0.71279999999999999,0.72599999999999998,530.64,562.47839999999997,573.09119999999996,583.70399999999995]
[96,6,0.66,0.6996,0.71279999999999999,0.72599999999999998,538.56000000000006,570.87360000000001,581.64479999999992,592.41600000000005]
[97,7,0.66,0.6996,0.71279999999999999,0.72599999999999998,546.48,579.26879999999994,590.19839999999999,601.12800000000004]
[98,8,0.66,0.6996,0.71279999999999999,0.72599999999999998,554.4,587.66399999999999,598.75199999999995,609.84]
[99,9,0.66,0.6996,0.71279999999999999,0.72599999999999998,562.32000000000005,596.05919999999992,607.30559999999991,618.55200000000002]
[100,10,0.66,0.6996,0.71279999999999999,0.72599999999999998,570.24,604.45439999999996,615.85919999999987,627.26400000000001]
[101,11,0.66,0.6996,0.71279999999999999,0.72599999999999998,578.16000000000008,612.84960000000001,624.41279999999995,635.976]
[102,12,0.66,0.6996,0.71279999999999999,0.72599999999999998,586.08000000000004,621.24479999999994,632.96639999999991,644.68799999999999]
[103,13,0.66,0.6996,0.71279999999999999,0.72599999999999998,594,629.64,641.52,653.4]
[104,14,0.66,0.6996,0.71279999999999999,0.72599999999999998,601.92000000000007,638.03519999999992,650.07359999999994,662.11199999999997]
[105,15,0.66,0.6996,0.71279999999999999,0.72599999999999998,609.84,646.43039999999996,658.6271999999999,670.82400000000007]
[106,16,0.66,0.6996,0.71279999999999999,0.72599999999999998,617.76,654.82559999999989,667.18079999999986,679.53600000000006]
[107,17,0.66,0.6996,0.71279999999999999,0.72599999999999998,625.68000000000006,{"$f":"H$99+D116*$B116*12","v":663.22079999999994},{"$f":"I$99+E116*$B116*12","v":675.73439999999994},{"$f":"J$99+F116*$B116*12","v":688.24800000000005}]
[108,18,0.66,0.6996,0.71279999999999999,0.72599999999999998,633.6,671.61599999999999,684.2879999999999,696.96]
[109,19,0.66,0.6996,0.71279999999999999,0.72599999999999998,641.52,680.01119999999992,692.84159999999997,705.67200000000003]
[110,20,0.66,0.6996,0.71279999999999999,0.72599999999999998,649.44000000000005,688.40639999999996,701.39519999999993,714.38400000000001]
[111,1,0.75,0.79500000000000004,0.81,0.82499999999999996,{"$f":"G$119+$B120*C120*12","v":658.44},{"$f":"H$119+$B120*D120*12","v":697.94639999999993},711.11519999999996,724.28399999999999]
[112,2,0.75,0.79500000000000004,0.81,0.82499999999999996,{"$f":"G$119+$B121*C121*12","v":667.44},707.4864,720.83519999999999,734.18399999999997]
[113,3,0.75,0.79500000000000004,0.81,0.82499999999999996,676.44,717.02639999999997,730.5551999999999,744.08400000000006]
[114,4,0.75,0.79500000000000004,0.81,0.82499999999999996,685.44,726.56639999999993,740.27519999999993,753.98400000000004]
[115,5,0.75,0.79500000000000004,0.81,0.82499999999999996,694.44,736.10640000000001,749.99519999999995,763.88400000000001]
[116,6,0.75,0.79500000000000004,0.81,0.82499999999999996,703.44,745.64639999999997,759.71519999999998,773.78399999999999]
[117,7,0.75,0.79500000000000004,0.81,0.82499999999999996,712.44,755.18639999999994,769.4351999999999,783.68399999999997]
[118,8,0.75,0.79500000000000004,0.81,0.82499999999999996,721.44,764.72640000000001,779.15519999999992,793.58400000000006]
[119,9,0.75,0.79500000000000004,0.81,0.82499999999999996,730.44,774.26639999999998,788.87519999999995,803.48400000000004]
[120,10,0.75,0.79500000000000004,0.81,0.82499999999999996,739.44,783.80639999999994,798.59519999999998,813.38400000000001]
[121,11,0.75,0.79500000000000004,0.81,0.82499999999999996,748.44,793.34640000000002,808.31519999999989,823.28399999999999]
[122,12,0.75,0.79500000000000004,0.81,0.82499999999999996,757.44,802.88639999999998,818.03519999999992,833.18399999999997]
[123,13,0.75,0.79500000000000004,0.81,0.82499999999999996,766.44,812.42639999999994,827.75519999999995,843.08400000000006]
[124,14,0.75,0.79500000000000004,0.81,0.82499999999999996,775.44,821.96640000000002,837.47519999999986,852.98400000000004]
[125,15,0.75,0.79500000000000004,0.81,0.82499999999999996,784.44,831.50639999999999,847.19519999999989,862.88400000000001]
[126,16,0.75,0.79500000000000004,0.81,0.82499999999999996,793.44,841.04639999999995,856.91519999999991,872.78399999999999]
[127,17,0.75,0.79500000000000004,0.81,0.82499999999999996,802.44,{"$f":"H$119+$B136*D136*12","v":850.58639999999991},{"$f":"I$119+$B136*E136*12","v":866.63519999999994},{"$f":"J$119+$B136*F136*12","v":882.68399999999997}]
[128,18,0.75,0.79500000000000004,0.81,0.82499999999999996,811.44,860.12639999999999,876.35519999999997,892.58400000000006]
[129,19,0.75,0.79500000000000004,0.81,0.82499999999999996,820.44,869.66639999999995,886.0752,902.48400000000004]
[130,20,0.75,0.79500000000000004,0.81,0.82499999999999996,829.44,879.20640000000003,895.79520000000002,912.38400000000001]
[131,21,0.75,0.79500000000000004,0.81,0.82499999999999996,838.44,888.74639999999999,905.51519999999994,922.28399999999999]
[132,22,0.75,0.79500000000000004,0.81,0.82499999999999996,847.44,898.28639999999996,915.23519999999996,932.18399999999997]
[133,23,0.75,0.79500000000000004,0.81,0.82499999999999996,856.44,907.82639999999992,924.95519999999999,942.08400000000006]
[134,24,0.75,0.79500000000000004,0.81,0.82499999999999996,865.44,917.3664,934.6751999999999,951.98399999999992]
[135,25,0.75,0.79500000000000004,0.81,0.82499999999999996,874.44,926.90639999999996,944.39519999999993,961.88400000000001]
[136,26,0.75,0.79500000000000004,0.81,0.82499999999999996,883.44,936.44640000000004,954.11519999999996,971.78399999999999]
[137,27,0.75,0.79500000000000004,0.81,0.82499999999999996,892.44,945.9864,963.83519999999999,981.68399999999997]
[138,28,0.75,0.79500000000000004,0.81,0.82499999999999996,901.44,955.52639999999997,973.5551999999999,991.58400000000006]
[139,29,0.75,0.79500000000000004,0.81,0.82499999999999996,910.44,965.06639999999993,983.27519999999993,1001.4839999999999]
[140,30,0.75,0.79500000000000004,0.81,0.82499999999999996,919.44,974.60640000000001,992.99519999999995,1011.384]
[141,31,0.75,0.79500000000000004,0.81,0.82499999999999996,928.44,984.14639999999997,1002.7152,1021.284]
[142,32,0.75,0.79500000000000004,0.81,0.82499999999999996,937.44,993.68640000000005,1012.4351999999999,1031.184]
[143,33,0.75,0.79500000000000004,0.81,0.82499999999999996,946.44,1003.2264,1022.1551999999999,1041.0840000000001]
[144,34,0.75,0.79500000000000004,0.81,0.82499999999999996,955.44,1012.7664,1031.8751999999999,1050.9839999999999]
[145,35,0.75,0.79500000000000004,0.81,0.82499999999999996,964.44,1022.3063999999999,1041.5952,1060.884]
[146,36,0.75,0.79500000000000004,0.81,0.82499999999999996,973.44,1031.8463999999999,1051.3152,1070.7840000000001]
[147,37,0.75,0.79500000000000004,0.81,0.82499999999999996,982.44,1041.3863999999999,1061.0352,1080.684]
[148,38,0.75,0.79500000000000004,0.81,0.82499999999999996,991.44,1050.9263999999998,1070.7552000000001,1090.5840000000001]
[149,39,0.75,0.79500000000000004,0.81,0.82499999999999996,1000.44,1060.4664,1080.4751999999999,1100.4839999999999]
[150,40,0.75,0.79500000000000004,0.81,0.82499999999999996,1009.44,1070.0064,1090.1952000000001,1110.384]
[151,41,0.75,0.79500000000000004,0.81,0.82499999999999996,1018.44,1079.5463999999999,1099.9151999999999,1120.2840000000001]
[152,42,0.75,0.79500000000000004,0.81,0.82499999999999996,1027.44,1089.0863999999999,1109.6351999999999,1130.184]
[153,43,0.75,0.79500000000000004,0.81,0.82499999999999996,1036.44,1098.6264000000001,1119.3552,1140.0840000000001]
[154,44,0.75,0.79500000000000004,0.81,0.82499999999999996,1045.44,1108.1664000000001,1129.0752,1149.9839999999999]
[155,45,0.75,0.79500000000000004,0.81,0.82499999999999996,1054.44,1117.7064,1138.7952,1159.884]
[156,46,0.75,0.79500000000000004,0.81,0.82499999999999996,1063.44,1127.2464,1148.5152,1169.7840000000001]
[157,47,0.75,0.79500000000000004,0.81,0.82499999999999996,1072.44,1136.7864,1158.2352000000001,1179.684]
[158,48,0.75,0.79500000000000004,0.81,0.82499999999999996,1081.44,1146.3263999999999,1167.9551999999999,1189.5839999999998]
[159,49,0.75,0.79500000000000004,0.81,0.82499999999999996,1090.44,1155.8663999999999,1177.6752000000001,1199.4839999999999]
[160,50,0.75,0.79500000000000004,0.81,0.82499999999999996,1099.44,1165.4063999999998,1187.3951999999999,1209.384]
[161,51,0.75,0.79500000000000004,0.81,0.82499999999999996,1108.44,1174.9464,1197.1152,1219.2840000000001]
[162,52,0.75,0.79500000000000004,0.81,0.82499999999999996,1117.44,1184.4864,1206.8352,1229.184]
[163,53,0.75,0.79500000000000004,0.81,0.82499999999999996,1126.44,1194.0264,1216.5551999999998,1239.0839999999998]
[164,54,0.75,0.79500000000000004,0.81,0.82499999999999996,1135.44,1203.5663999999999,1226.2752,1248.9839999999999]
[165,55,0.75,0.79500000000000004,0.81,0.82499999999999996,1144.44,1213.1064000000001,1235.9951999999998,1258.884]
[166,56,0.75,0.79500000000000004,0.81,0.82499999999999996,1153.44,1222.6464000000001,1245.7151999999999,1268.7840000000001]
[167,57,0.75,0.79500000000000004,0.81,0.82499999999999996,1162.44,1232.1864,1255.4351999999999,1278.684]
[168,58,0.75,0.79500000000000004,0.81,0.82499999999999996,1171.44,1241.7264,1265.1551999999999,1288.5839999999998]
[169,59,0.75,0.79500000000000004,0.81,0.82499999999999996,1180.44,1251.2664,1274.8751999999999,1298.4839999999999]
[170,60,0.75,0.79500000000000004,0.81,0.82499999999999996,1189.44,1260.8063999999999,1284.5952,1308.384]
[171,61,0.75,0.79500000000000004,0.81,0.82499999999999996,1198.44,1270.3463999999999,1294.3152,1318.2840000000001]
[172,62,0.75,0.79500000000000004,0.81,0.82499999999999996,1207.44,1279.8863999999999,1304.0352,1328.184]
[173,63,0.75,0.79500000000000004,0.81,0.82499999999999996,1216.44,1289.4263999999998,1313.7552000000001,1338.0839999999998]
[174,64,0.75,0.79500000000000004,0.81,0.82499999999999996,1225.44,1298.9664,1323.4751999999999,1347.9839999999999]
[175,65,0.75,0.79500000000000004,0.81,0.82499999999999996,1234.44,1308.5064,1333.1952000000001,1357.884]
[176,66,0.75,0.79500000000000004,0.81,0.82499999999999996,{"$f":"G$119+$B185*C185*12","v":1243.44},1318.0464000000002,1342.9151999999999,1367.7840000000001]
[177,67,0.75,0.79500000000000004,0.81,0.82499999999999996,1252.44,1327.5864000000001,1352.6351999999999,1377.684]
[178,68,0.75,0.79500000000000004,0.81,0.82499999999999996,1261.44,1337.1264000000001,1362.3552,1387.5839999999998]
[179,69,0.75,0.79500000000000004,0.81,0.82499999999999996,1270.44,1346.6664000000001,1372.0752,1397.4839999999999]
[180,70,0.75,0.79500000000000004,0.81,0.82499999999999996,1279.44,1356.2064,1381.7952,1407.384]
[181,71,0.75,0.79500000000000004,0.81,0.82499999999999996,1288.44,1365.7464,1391.5152,1417.2840000000001]
[182,72,0.75,0.79500000000000004,0.81,0.82499999999999996,1297.44,1375.2864,1401.2352000000001,1427.184]
[183,73,0.75,0.79500000000000004,0.81,0.82499999999999996,1306.44,1384.8263999999999,1410.9551999999999,1437.0839999999998]
[184,74,0.75,0.79500000000000004,0.81,0.82499999999999996,1315.44,1394.3663999999999,1420.6752000000001,1446.9839999999999]
[185,75,0.75,0.79500000000000004,0.81,0.82499999999999996,1324.44,1403.9063999999998,1430.3951999999999,1456.884]
[186,76,0.75,0.79500000000000004,0.81,0.82499999999999996,1333.44,1413.4463999999998,1440.1152,1466.7840000000001]
[187,77,0.75,0.79500000000000004,0.81,0.82499999999999996,1342.44,1422.9864,1449.8352,1476.684]
[188,78,0.75,0.79500000000000004,0.81,0.82499999999999996,1351.44,1432.5264000000002,1459.5552,1486.5839999999998]
[189,79,0.75,0.79500000000000004,0.81,0.82499999999999996,1360.44,1442.0663999999999,1469.2752,1496.4839999999999]
[190,80,0.75,0.79500000000000004,0.81,0.82499999999999996,1369.44,1451.6064000000001,1478.9952000000001,1506.384]
[191,81,0.75,0.79500000000000004,0.81,0.82499999999999996,1378.44,{"$f":"H$119+$B200*D200*12","v":1461.1464000000001},{"$f":"I$119+$B200*E200*12","v":1488.7151999999999},{"$f":"J$119+$B200*F200*12","v":1516.2840000000001}]
[192,82,0.75,0.79500000000000004,0.81,0.82499999999999996,1387.44,1470.6864,1498.4351999999999,1526.184]
[193,83,0.75,0.79500000000000004,0.81,0.82499999999999996,1396.44,1480.2264,1508.1551999999999,1536.0839999999998]
[194,84,0.75,0.79500000000000004,0.81,0.82499999999999996,1405.44,1489.7664,1517.8751999999999,1545.9839999999999]
[195,85,0.75,0.79500000000000004,0.81,0.82499999999999996,1414.44,1499.3063999999999,1527.5952,1555.884]
[196,86,0.75,0.79500000000000004,0.81,0.82499999999999996,1423.44,1508.8463999999999,1537.3152,1565.7840000000001]
[197,87,0.75,0.79500000000000004,0.81,0.82499999999999996,1432.44,1518.3863999999999,1547.0351999999998,1575.684]
[198,88,0.75,0.79500000000000004,0.81,0.82499999999999996,1441.44,1527.9264000000001,1556.7552000000001,1585.5839999999998]
[199,89,0.75,0.79500000000000004,0.81,0.82499999999999996,1450.44,1537.4664000000002,1566.4751999999999,1595.4839999999999]
[200,90,0.75,0.79500000000000004,0.81,0.82499999999999996,1459.44,1547.0063999999998,1576.1952000000001,1605.384]
[201,91,0.75,0.79500000000000004,0.81,0.82499999999999996,1468.44,1556.5463999999999,1585.9151999999999,1615.2840000000001]
[202,92,0.75,0.79500000000000004,0.81,0.82499999999999996,1477.44,1566.0864000000001,1595.6352000000002,1625.184]
[203,93,0.75,0.79500000000000004,0.81,0.82499999999999996,1486.44,1575.6264000000001,1605.3552,1635.0839999999998]
[204,94,0.75,0.79500000000000004,0.81,0.82499999999999996,1495.44,1585.1664000000001,1615.0752,1644.9839999999999]
[205,95,0.75,0.79500000000000004,0.81,0.82499999999999996,1504.44,1594.7064,1624.7952,1654.884]
[206,96,0.75,0.79500000000000004,0.81,0.82499999999999996,1513.44,1604.2464,1634.5152,1664.7839999999999]
[207,97,0.75,0.79500000000000004,0.81,0.82499999999999996,1522.44,1613.7864,1644.2352000000001,1674.684]
[208,98,0.75,0.79500000000000004,0.81,0.82499999999999996,1531.44,1623.3263999999999,1653.9552000000001,1684.5839999999998]
[209,99,0.75,0.79500000000000004,0.81,0.82499999999999996,1540.44,1632.8663999999999,1663.6752000000001,1694.4839999999999]
[210,100,0.75,0.79500000000000004,0.81,0.82499999999999996,1549.44,1642.4063999999998,1673.3951999999999,1704.384]
[211,101,0.75,0.79500000000000004,0.81,0.82499999999999996,1558.44,1651.9463999999998,1683.1152,1714.2839999999999]
[212,102,0.75,0.79500000000000004,0.81,0.82499999999999996,1567.44,1661.4864,1692.8352,1724.184]
[213,103,0.75,0.79500000000000004,0.81,0.82499999999999996,1576.44,1671.0264000000002,1702.5552,1734.0839999999998]
[214,104,0.75,0.79500000000000004,0.81,0.82499999999999996,1585.44,1680.5664000000002,1712.2752,1743.9839999999999]
[215,105,0.75,0.79500000000000004,0.81,0.82499999999999996,1594.44,1690.1064000000001,1721.9952000000001,1753.884]
[216,106,0.75,0.79500000000000004,0.81,0.82499999999999996,1603.44,1699.6464000000001,1731.7151999999999,1763.7839999999999]
[217,107,0.75,0.79500000000000004,0.81,0.82499999999999996,1612.44,1709.1864,1741.4351999999999,1773.684]
[218,108,0.75,0.79500000000000004,0.81,0.82499999999999996,1621.44,1718.7264,1751.1551999999999,1783.5839999999998]
[219,109,0.75,0.79500000000000004,0.81,0.82499999999999996,1630.44,1728.2664,1760.8751999999999,1793.4839999999999]
[220,110,0.75,0.79500000000000004,0.81,0.82499999999999996,1639.44,1737.8063999999999,1770.5952,1803.384]
[221,111,0.75,0.79500000000000004,0.81,0.82499999999999996,1648.44,1747.3463999999999,1780.3152,1813.2839999999999]
[222,112,0.75,0.79500000000000004,0.81,0.82499999999999996,1657.44,1756.8863999999999,1790.0351999999998,1823.184]
[223,113,0.75,0.79500000000000004,0.81,0.82499999999999996,1666.44,1766.4263999999998,1799.7552000000001,1833.0839999999998]
[224,114,0.75,0.79500000000000004,0.81,0.82499999999999996,1675.44,1775.9664000000002,1809.4751999999999,1842.9839999999999]
[225,115,0.75,0.79500000000000004,0.81,0.82499999999999996,1684.44,1785.5064000000002,1819.1952000000001,1852.884]
[226,116,0.75,0.79500000000000004,0.81,0.82499999999999996,1693.44,1795.0463999999997,1828.9151999999999,1862.7839999999999]
[227,117,0.75,0.79500000000000004,0.81,0.82499999999999996,1702.44,1804.5864000000001,1838.6352000000002,1872.684]
[228,118,0.75,0.79500000000000004,0.81,0.82499999999999996,1711.44,1814.1264000000001,1848.3552,1882.5839999999998]
[229,119,0.75,0.79500000000000004,0.81,0.82499999999999996,1720.44,1823.6664000000001,1858.0752,1892.4839999999999]
[230,120,0.75,0.79500000000000004,0.81,0.82499999999999996,1729.44,1833.2064,1867.7952,1902.384]
[231,121,0.75,0.79500000000000004,0.81,0.82499999999999996,1738.44,1842.7464,1877.5152,1912.2839999999999]
[232,122,0.75,0.79500000000000004,0.81,0.82499999999999996,1747.44,1852.2864,1887.2352000000001,1922.184]
[233,123,0.75,0.79500000000000004,0.81,0.82499999999999996,1756.44,1861.8263999999999,1896.9552000000001,1932.0839999999998]
[234,124,0.75,0.79500000000000004,0.81,0.82499999999999996,1765.44,1871.3663999999999,1906.6752000000001,1941.9839999999999]
[235,125,0.75,0.79500000000000004,0.81,0.82499999999999996,1774.44,1880.9063999999998,1916.3951999999999,1951.884]
[236,126,0.75,0.79500000000000004,0.81,0.82499999999999996,1783.44,1890.4463999999998,1926.1152,1961.7839999999999]
[237,127,0.75,0.79500000000000004,0.81,0.82499999999999996,1792.44,1899.9863999999998,1935.8352,1971.684]
[238,128,0.75,0.79500000000000004,0.81,0.82499999999999996,1801.44,1909.5264000000002,1945.5552,1981.5839999999998]
[239,129,0.75,0.79500000000000004,0.81,0.82499999999999996,1810.44,1919.0664000000002,1955.2752,1991.4839999999999]
[240,130,0.75,0.79500000000000004,0.81,0.82499999999999996,{"$f":"G$119+$B249*C249*12","v":1819.44},1928.6064000000001,1964.9952000000001,2001.384]
[241,131,0.75,0.79500000000000004,0.81,0.82499999999999996,1828.44,1938.1464000000001,1974.7152000000001,2011.2839999999999]
[242,132,0.75,0.79500000000000004,0.81,0.82499999999999996,1837.44,1947.6864,1984.4351999999999,2021.184]
[243,133,0.75,0.79500000000000004,0.81,0.82499999999999996,1846.44,1957.2264,1994.1551999999999,2031.0839999999998]
[244,134,0.75,0.79500000000000004,0.81,0.82499999999999996,1855.44,1966.7664,2003.8751999999999,2040.9839999999999]
[245,135,0.75,0.79500000000000004,0.81,0.82499999999999996,1864.44,1976.3063999999999,2013.5952,2050.884]
[246,136,0.75,0.79500000000000004,0.81,0.82499999999999996,1873.44,1985.8463999999999,2023.3152,2060.7839999999997]
[247,137,0.75,0.79500000000000004,0.81,0.82499999999999996,1882.44,1995.3863999999999,2033.0352,2070.6840000000002]
[248,138,0.75,0.79500000000000004,0.81,0.82499999999999996,1891.44,2004.9263999999998,2042.7552000000001,2080.5839999999998]
[249,139,0.75,0.79500000000000004,0.81,0.82499999999999996,1900.44,2014.4664000000002,2052.4751999999999,2090.4839999999999]
[250,140,0.75,0.79500000000000004,0.81,0.82499999999999996,1909.44,2024.0064000000002,2062.1952000000001,2100.384]
[251,141,0.75,0.79500000000000004,0.81,0.82499999999999996,1918.44,2033.5463999999997,2071.9151999999999,2110.2839999999997]
[252,142,0.75,0.79500000000000004,0.81,0.82499999999999996,1927.44,2043.0864000000001,2081.6352000000002,2120.1840000000002]
[253,143,0.75,0.79500000000000004,0.81,0.82499999999999996,1936.44,2052.6264000000001,2091.3552,2130.0839999999998]
[254,144,0.75,0.79500000000000004,0.81,0.82499999999999996,1945.44,2062.1664000000001,2101.0752000000002,2139.9839999999999]
[255,145,0.75,0.79500000000000004,0.81,0.82499999999999996,1954.44,{"$f":"H$119+$B264*D264*12","v":2071.7064},{"$f":"I$119+$B264*E264*12","v":2110.7952},{"$f":"J$119+$B264*F264*12","v":2149.884}]
[256,146,0.75,0.79500000000000004,0.81,0.82499999999999996,1963.44,2081.2464,2120.5151999999998,2159.7839999999997]
[257,147,0.75,0.79500000000000004,0.81,0.82499999999999996,1972.44,2090.7864,2130.2352000000001,2169.6840000000002]
[258,148,0.75,0.79500000000000004,0.81,0.82499999999999996,1981.44,2100.3263999999999,2139.9552000000003,2179.5839999999998]
[259,149,0.75,0.79500000000000004,0.81,0.82499999999999996,1990.44,2109.8663999999999,2149.6752000000001,2189.4839999999999]
[260,150,0.75,0.79500000000000004,0.81,0.82499999999999996,1999.44,2119.4063999999998,2159.3951999999999,2199.384]
[261,151,0.75,0.79500000000000004,0.81,0.82499999999999996,2008.44,2128.9463999999998,2169.1152000000002,2209.2839999999997]
[262,152,0.75,0.79500000000000004,0.81,0.82499999999999996,2017.44,2138.4863999999998,2178.8352,2219.1840000000002]
[263,153,0.75,0.79500000000000004,0.81,0.82499999999999996,2026.44,2148.0264000000002,2188.5551999999998,2229.0839999999998]
[264,154,0.75,0.79500000000000004,0.81,0.82499999999999996,2035.44,2157.5664000000002,2198.2752,2238.9839999999999]
[265,155,0.75,0.79500000000000004,0.81,0.82499999999999996,2044.44,2167.1064000000001,2207.9952000000003,2248.884]
[266,156,0.75,0.79500000000000004,0.81,0.82499999999999996,2053.44,2176.6464000000001,2217.7152000000001,2258.7839999999997]
[267,157,0.75,0.79500000000000004,0.81,0.82499999999999996,2062.44,2186.1864,2227.4351999999999,2268.6840000000002]
[268,158,0.75,0.79500000000000004,0.81,0.82499999999999996,2071.44,2195.7264,2237.1552000000001,2278.5839999999998]
[269,159,0.75,0.79500000000000004,0.81,0.82499999999999996,2080.44,2205.2664,2246.8752000000004,2288.4839999999999]
[270,160,0.75,0.79500000000000004,0.81,0.82499999999999996,2089.44,2214.8063999999999,2256.5952000000002,2298.384]
[271,161,0.75,0.79500000000000004,0.81,0.82499999999999996,2098.44,2224.3463999999999,2266.3152,2308.2839999999997]
[272,162,0.75,0.79500000000000004,0.81,0.82499999999999996,2107.44,2233.8864000000003,2276.0351999999998,2318.1840000000002]
[273,163,0.75,0.79500000000000004,0.81,0.82499999999999996,2116.44,2243.4263999999998,2285.7552000000001,2328.0839999999998]
[274,164,0.75,0.79500000000000004,0.81,0.82499999999999996,2125.44,2252.9663999999998,2295.4751999999999,2337.9839999999999]
[275,165,0.75,0.79500000000000004,0.81,0.82499999999999996,2134.44,2262.5064000000002,2305.1952000000001,2347.884]
[276,166,0.75,0.79500000000000004,0.81,0.82499999999999996,2143.44,2272.0463999999997,2314.9151999999999,2357.7839999999997]
[277,167,0.75,0.79500000000000004,0.81,0.82499999999999996,2152.44,2281.5864000000001,2324.6352000000002,2367.6840000000002]
[278,168,0.75,0.79500000000000004,0.81,0.82499999999999996,2161.44,2291.1264000000001,2334.3552,2377.5839999999998]
[279,169,0.75,0.79500000000000004,0.81,0.82499999999999996,2170.44,2300.6664000000001,2344.0752000000002,2387.4839999999999]
[280,170,0.75,0.79500000000000004,0.81,0.82499999999999996,2179.44,2310.2064,2353.7952,2397.384]
[281,171,0.75,0.79500000000000004,0.81,0.82499999999999996,2188.44,2319.7464,2363.5152000000003,2407.2839999999997]
[282,172,0.75,0.79500000000000004,0.81,0.82499999999999996,2197.44,2329.2864,2373.2352000000001,2417.1840000000002]
[283,173,0.75,0.79500000000000004,0.81,0.82499999999999996,2206.44,2338.8263999999999,2382.9551999999999,2427.0839999999998]
[284,174,0.75,0.79500000000000004,0.81,0.82499999999999996,2215.44,2348.3663999999999,2392.6751999999997,2436.9839999999999]
[285,175,0.75,0.79500000000000004,0.81,0.82499999999999996,2224.44,2357.9063999999998,2402.3951999999999,2446.884]
[286,176,0.75,0.79500000000000004,0.81,0.82499999999999996,2233.44,2367.4464000000003,2412.1152000000002,2456.7839999999997]
[287,177,0.75,0.79500000000000004,0.81,0.82499999999999996,2242.44,2376.9863999999998,2421.8352,2466.6840000000002]
[288,178,0.75,0.79500000000000004,0.81,0.82499999999999996,2251.44,2386.5264000000002,2431.5551999999998,2476.5839999999998]
[289,179,0.75,0.79500000000000004,0.81,0.82499999999999996,2260.44,2396.0664000000002,2441.2752,2486.4839999999999]
[290,180,0.75,0.79500000000000004,0.81,0.82499999999999996,2269.44,2405.6063999999997,2450.9952000000003,2496.384]
[291,181,0.75,0.79500000000000004,0.81,0.82499999999999996,2278.44,2415.1464000000001,2460.7152000000001,2506.2839999999997]
[292,182,0.75,0.79500000000000004,0.81,0.82499999999999996,2287.44,2424.6864,2470.4351999999999,2516.1840000000002]
[293,183,0.75,0.79500000000000004,0.81,0.82499999999999996,2296.44,2434.2264,2480.1552000000001,2526.0839999999998]
[294,184,0.75,0.79500000000000004,0.81,0.82499999999999996,2305.44,2443.7664,2489.8752000000004,2535.9839999999999]
[295,185,0.75,0.79500000000000004,0.81,0.82499999999999996,2314.44,2453.3063999999999,2499.5952000000002,2545.884]
[296,186,0.75,0.79500000000000004,0.81,0.82499999999999996,2323.44,2462.8463999999999,2509.3152,2555.7839999999997]
[297,187,0.75,0.79500000000000004,0.81,0.82499999999999996,2332.44,2472.3864000000003,2519.0351999999998,2565.6840000000002]
[298,188,0.75,0.79500000000000004,0.81,0.82499999999999996,2341.44,2481.9263999999998,2528.7552000000001,2575.5839999999998]
[299,189,0.75,0.79500000000000004,0.81,0.82499999999999996,2350.44,2491.4663999999998,2538.4751999999999,2585.4839999999999]
[300,190,0.75,0.79500000000000004,0.81,0.82499999999999996,2359.44,2501.0064000000002,2548.1952000000001,2595.384]
[301,191,0.75,0.79500000000000004,0.81,0.82499999999999996,2368.44,2510.5463999999997,2557.9151999999999,2605.2839999999997]
[302,192,0.75,0.79500000000000004,0.81,0.82499999999999996,2377.44,2520.0864000000001,2567.6352000000002,2615.1839999999997]
[303,193,0.75,0.79500000000000004,0.81,0.82499999999999996,2386.44,2529.6264000000001,2577.3552,2625.0839999999998]
[304,194,0.75,0.79500000000000004,0.81,0.82499999999999996,{"$f":"G$119+$B313*C313*12","v":2395.44},2539.1664000000001,2587.0752000000002,2634.9839999999999]
[305,195,0.75,0.79500000000000004,0.81,0.82499999999999996,2404.44,2548.7064,2596.7952,2644.884]
[306,196,0.75,0.79500000000000004,0.81,0.82499999999999996,2413.44,2558.2464,2606.5152000000003,2654.7839999999997]
[307,197,0.75,0.79500000000000004,0.81,0.82499999999999996,2422.44,2567.7864,2616.2352000000001,2664.6839999999997]
[308,198,0.75,0.79500000000000004,0.81,0.82499999999999996,2431.44,2577.3263999999999,2625.9552000000003,2674.5839999999998]
[309,199,0.75,0.79500000000000004,0.81,0.82499999999999996,2440.44,2586.8663999999999,2635.6751999999997,2684.4839999999999]
[310,200,0.75,0.79500000000000004,0.81,0.82499999999999996,2449.44,2596.4063999999998,2645.3951999999999,2694.384]
[311,201,0.75,0.79500000000000004,0.81,0.82499999999999996,2458.44,2605.9464000000003,2655.1152000000002,2704.2839999999997]
[312,202,0.75,0.79500000000000004,0.81,0.82499999999999996,2467.44,2615.4863999999998,2664.8352,2714.1839999999997]
[313,203,0.75,0.79500000000000004,0.81,0.82499999999999996,2476.44,2625.0264000000002,2674.5551999999998,2724.0839999999998]
[314,204,0.75,0.79500000000000004,0.81,0.82499999999999996,2485.44,2634.5664000000002,2684.2752,2733.9839999999999]
[315,205,0.75,0.79500000000000004,0.81,0.82499999999999996,2494.44,2644.1063999999997,2693.9952000000003,2743.884]
[316,206,0.75,0.79500000000000004,0.81,0.82499999999999996,2503.44,2653.6464000000001,2703.7152000000001,2753.7839999999997]
[317,207,0.75,0.79500000000000004,0.81,0.82499999999999996,2512.44,2663.1864,2713.4351999999999,2763.6839999999997]
[318,208,0.75,0.79500000000000004,0.81,0.82499999999999996,2521.44,2672.7264,2723.1552000000001,2773.5839999999998]
[319,209,0.75,0.79500000000000004,0.81,0.82499999999999996,2530.44,{"$f":"H$119+$B328*D328*12","v":2682.2664},{"$f":"I$119+$B328*E328*12","v":2732.8752000000004},{"$f":"J$119+$B328*F328*12","v":2783.4839999999999}]
[320,210,0.75,0.79500000000000004,0.81,0.82499999999999996,2539.44,2691.8063999999999,2742.5952000000002,2793.384]
[321,211,0.75,0.79500000000000004,0.81,0.82499999999999996,2548.44,2701.3463999999999,2752.3152,2803.2839999999997]
[322,212,0.75,0.79500000000000004,0.81,0.82499999999999996,2557.44,2710.8864000000003,2762.0351999999998,2813.1839999999997]
[323,213,0.75,0.79500000000000004,0.81,0.82499999999999996,2566.44,2720.4263999999998,2771.7552000000001,2823.0839999999998]
[324,214,0.75,0.79500000000000004,0.81,0.82499999999999996,2575.44,2729.9663999999998,2781.4751999999999,2832.9839999999999]
[325,215,0.75,0.79500000000000004,0.81,0.82499999999999996,2584.44,2739.5064000000002,2791.1952000000001,2842.884]
[326,216,0.75,0.79500000000000004,0.81,0.82499999999999996,2593.44,2749.0463999999997,2800.9151999999999,2852.7839999999997]
[327,217,0.75,0.79500000000000004,0.81,0.82499999999999996,2602.44,2758.5864000000001,2810.6352000000002,2862.6839999999997]
[328,218,0.75,0.79500000000000004,0.81,0.82499999999999996,2611.44,2768.1264000000001,2820.3552,2872.5839999999998]
[329,219,0.75,0.79500000000000004,0.81,0.82499999999999996,2620.44,2777.6664000000001,2830.0752000000002,2882.4839999999999]
[330,220,0.75,0.79500000000000004,0.81,0.82499999999999996,2629.44,2787.2064,2839.7952,2892.384]
[331,221,0.75,0.79500000000000004,0.81,0.82499999999999996,2638.44,2796.7464,2849.5152000000003,2902.2839999999997]
[332,222,0.75,0.79500000000000004,0.81,0.82499999999999996,2647.44,2806.2864,2859.2352000000001,2912.1839999999997]
[333,223,0.75,0.79500000000000004,0.81,0.82499999999999996,2656.44,2815.8263999999999,2868.9552000000003,2922.0839999999998]
[334,224,0.75,0.79500000000000004,0.81,0.82499999999999996,2665.44,2825.3663999999999,2878.6751999999997,2931.9839999999999]
[335,225,0.75,0.79500000000000004,0.81,0.82499999999999996,2674.44,2834.9063999999998,2888.3951999999999,2941.884]
[336,226,0.75,0.79500000000000004,0.81,0.82499999999999996,2683.44,2844.4463999999998,2898.1152000000002,2951.7839999999997]
[337,227,0.75,0.79500000000000004,0.81,0.82499999999999996,2692.44,2853.9863999999998,2907.8352,2961.6839999999997]
[338,228,0.75,0.79500000000000004,0.81,0.82499999999999996,2701.44,2863.5264000000002,2917.5551999999998,2971.5839999999998]
[339,229,0.75,0.79500000000000004,0.81,0.82499999999999996,2710.44,2873.0663999999997,2927.2752,2981.4839999999999]
[340,230,0.75,0.79500000000000004,0.81,0.82499999999999996,2719.44,2882.6064000000001,2936.9952000000003,2991.384]
[341,231,0.75,0.79500000000000004,0.81,0.82499999999999996,2728.44,2892.1464000000001,2946.7152000000001,3001.2839999999997]
[342,232,0.75,0.79500000000000004,0.81,0.82499999999999996,2737.44,2901.6863999999996,2956.4351999999999,3011.1839999999997]
[343,233,0.75,0.79500000000000004,0.81,0.82499999999999996,2746.44,2911.2264,2966.1552000000001,3021.0839999999998]
[344,234,0.75,0.79500000000000004,0.81,0.82499999999999996,2755.44,2920.7664,2975.8752000000004,3030.9839999999999]
[345,235,0.75,0.79500000000000004,0.81,0.82499999999999996,2764.44,2930.3063999999999,2985.5952000000002,3040.884]
[346,236,0.75,0.79500000000000004,0.81,0.82499999999999996,2773.44,2939.8463999999999,2995.3152,3050.7839999999997]
[347,237,0.75,0.79500000000000004,0.81,0.82499999999999996,2782.44,2949.3864000000003,3005.0351999999998,3060.6839999999997]
[348,238,0.75,0.79500000000000004,0.81,0.82499999999999996,2791.44,2958.9263999999998,3014.7552000000001,3070.5839999999998]
[349,239,0.75,0.79500000000000004,0.81,0.82499999999999996,2800.44,2968.4663999999998,3024.4751999999999,3080.4839999999999]
[350,240,0.75,0.79500000000000004,0.81,0.82499999999999996,2809.44,2978.0064000000002,3034.1952000000001,3090.384]
[351,241,0.75,0.79500000000000004,0.81,0.82499999999999996,2818.44,2987.5463999999997,3043.9151999999999,3100.2839999999997]
[352,242,0.75,0.79500000000000004,0.81,0.82499999999999996,2827.44,2997.0864000000001,3053.6352000000002,3110.1839999999997]
[353,243,0.75,0.79500000000000004,0.81,0.82499999999999996,2836.44,3006.6264000000001,3063.3552,3120.0839999999998]
[354,244,0.75,0.79500000000000004,0.81,0.82499999999999996,2845.44,3016.1664000000001,3073.0752000000002,3129.9839999999999]
[355,245,0.75,0.79500000000000004,0.81,0.82499999999999996,2854.44,3025.7064,3082.7952,3139.884]
[356,246,0.75,0.79500000000000004,0.81,0.82499999999999996,2863.44,3035.2464,3092.5152000000003,3149.7839999999997]
[357,247,0.75,0.79500000000000004,0.81,0.82499999999999996,2872.44,3044.7864,3102.2352000000001,3159.6839999999997]
[358,248,0.75,0.79500000000000004,0.81,0.82499999999999996,2881.44,3054.3263999999999,3111.9552000000003,3169.5839999999998]
[359,249,0.75,0.79500000000000004,0.81,0.82499999999999996,2890.44,3063.8663999999999,3121.6752000000001,3179.4839999999999]
[360,250,0.75,0.79500000000000004,0.81,0.82499999999999996,2899.44,3073.4063999999998,3131.3951999999999,3189.384]
[361,251,0.75,0.79500000000000004,0.81,0.82499999999999996,2908.44,3082.9463999999998,3141.1152000000002,3199.2839999999997]
[362,252,0.75,0.79500000000000004,0.81,0.82499999999999996,2917.44,3092.4863999999998,3150.8352,3209.1839999999997]
[363,253,0.75,0.79500000000000004,0.81,0.82499999999999996,2926.44,3102.0264000000002,3160.5551999999998,3219.0839999999998]
[364,254,0.75,0.79500000000000004,0.81,0.82499999999999996,2935.44,3111.5663999999997,3170.2752,3228.9839999999999]
[365,255,0.75,0.79500000000000004,0.81,0.82499999999999996,2944.44,3121.1064000000001,3179.9952000000003,3238.884]
[366,256,0.75,0.79500000000000004,0.81,0.82499999999999996,2953.44,3130.6464000000001,3189.7152000000001,3248.7839999999997]
[367,257,0.75,0.79500000000000004,0.81,0.82499999999999996,2962.44,3140.1863999999996,3199.4351999999999,3258.6839999999997]
[368,258,0.75,0.79500000000000004,0.81,0.82499999999999996,{"$f":"G$119+$B377*C377*12","v":2971.44},3149.7264,3209.1552000000001,3268.5839999999998]
[369,259,0.75,0.79500000000000004,0.81,0.82499999999999996,2980.44,3159.2664,3218.8752000000004,3278.4839999999999]
[370,260,0.75,0.79500000000000004,0.81,0.82499999999999996,2989.44,3168.8063999999999,3228.5952000000002,3288.384]
[371,261,0.75,0.79500000000000004,0.81,0.82499999999999996,2998.44,3178.3463999999999,3238.3152,3298.2839999999997]
[372,262,0.75,0.79500000000000004,0.81,0.82499999999999996,3007.44,3187.8864000000003,3248.0352000000003,3308.1839999999997]
[373,263,0.75,0.79500000000000004,0.81,0.82499999999999996,3016.44,3197.4263999999998,3257.7552000000001,3318.0839999999998]
[374,264,0.75,0.79500000000000004,0.81,0.82499999999999996,3025.44,3206.9664000000002,3267.4751999999999,3327.9839999999999]
[375,265,0.75,0.79500000000000004,0.81,0.82499999999999996,3034.44,3216.5064000000002,3277.1952000000001,3337.884]
[376,266,0.75,0.79500000000000004,0.81,0.82499999999999996,3043.44,3226.0463999999997,3286.9151999999999,3347.7839999999997]
[377,267,0.75,0.79500000000000004,0.81,0.82499999999999996,3052.44,3235.5864000000001,3296.6352000000002,3357.6839999999997]
[378,268,0.75,0.79500000000000004,0.81,0.82499999999999996,3061.44,3245.1264000000001,3306.3552,3367.5839999999998]
[379,269,0.75,0.79500000000000004,0.81,0.82499999999999996,3070.44,3254.6664000000001,3316.0752000000002,3377.4839999999999]
[380,270,0.75,0.79500000000000004,0.81,0.82499999999999996,3079.44,3264.2064,3325.7952,3387.384]
[381,271,0.75,0.79500000000000004,0.81,0.82499999999999996,3088.44,3273.7464,3335.5152000000003,3397.2839999999997]
[382,272,0.75,0.79500000000000004,0.81,0.82499999999999996,3097.44,3283.2864,3345.2352000000001,3407.1839999999997]
[383,273,0.75,0.79500000000000004,0.81,0.82499999999999996,3106.44,{"$f":"H$119+$B392*D392*12","v":3292.8263999999999},{"$f":"I$119+$B392*E392*12","v":3354.9552000000003},{"$f":"J$119+$B392*F392*12","v":3417.0839999999998}]
[384,274,0.75,0.79500000000000004,0.81,0.82499999999999996,3115.44,3302.3663999999999,3364.6752000000001,3426.9839999999999]
[385,275,0.75,0.79500000000000004,0.81,0.82499999999999996,3124.44,3311.9063999999998,3374.3952000000004,3436.884]
[386,276,0.75,0.79500000000000004,0.81,0.82499999999999996,3133.44,3321.4463999999998,3384.1152000000002,3446.7839999999997]
[387,277,0.75,0.79500000000000004,0.81,0.82499999999999996,3142.44,3330.9863999999998,3393.8352,3456.6839999999997]
[388,278,0.75,0.79500000000000004,0.81,0.82499999999999996,3151.44,3340.5264000000002,3403.5551999999998,3466.5839999999998]
[389,279,0.75,0.79500000000000004,0.81,0.82499999999999996,3160.44,3350.0663999999997,3413.2752,3476.4839999999999]
[390,280,0.75,0.79500000000000004,0.81,0.82499999999999996,3169.44,3359.6064000000001,3422.9952000000003,3486.384]
[391,281,0.75,0.79500000000000004,0.81,0.82499999999999996,3178.44,3369.1464000000001,3432.7152000000001,3496.2839999999997]
[392,282,0.75,0.79500000000000004,0.81,0.82499999999999996,3187.44,3378.6863999999996,3442.4351999999999,3506.1839999999997]
[393,283,0.75,0.79500000000000004,0.81,0.82499999999999996,3196.44,3388.2264,3452.1552000000001,3516.0839999999998]
[394,284,0.75,0.79500000000000004,0.81,0.82499999999999996,3205.44,3397.7664,3461.8752000000004,3525.9839999999999]
[395,285,0.75,0.79500000000000004,0.81,0.82499999999999996,3214.44,3407.3063999999999,3471.5952000000002,3535.884]
[396,286,0.75,0.79500000000000004,0.81,0.82499999999999996,3223.44,3416.8463999999999,3481.3152,3545.7839999999997]
[397,287,0.75,0.79500000000000004,0.81,0.82499999999999996,3232.44,3426.3864000000003,3491.0352000000003,3555.6839999999997]
[398,288,0.75,0.79500000000000004,0.81,0.82499999999999996,3241.44,3435.9263999999998,3500.7552000000005,3565.5839999999998]
[399,289,0.75,0.79500000000000004,0.81,0.82499999999999996,3250.44,3445.4664000000002,3510.4751999999999,3575.4839999999999]
[400,290,0.75,0.79500000000000004,0.81,0.82499999999999996,3259.44,3455.0064000000002,3520.1952000000001,3585.384]
[401,291,0.75,0.79500000000000004,0.81,0.82499999999999996,3268.44,3464.5463999999997,3529.9151999999999,3595.2839999999997]
[402,292,0.75,0.79500000000000004,0.81,0.82499999999999996,3277.44,3474.0864000000001,3539.6352000000002,3605.1839999999997]
[403,293,0.75,0.79500000000000004,0.81,0.82499999999999996,3286.44,3483.6264000000001,3549.3552,3615.0839999999998]
[404,294,0.75,0.79500000000000004,0.81,0.82499999999999996,3295.44,3493.1664000000001,3559.0752000000002,3624.9839999999999]
[405,295,0.75,0.79500000000000004,0.81,0.82499999999999996,3304.44,3502.7064,3568.7952,3634.884]
[406,296,0.75,0.79500000000000004,0.81,0.82499999999999996,3313.44,3512.2464,3578.5152000000003,3644.7839999999997]
[407,297,0.75,0.79500000000000004,0.81,0.82499999999999996,3322.44,3521.7864,3588.2352000000001,3654.6839999999997]
[408,298,0.75,0.79500000000000004,0.81,0.82499999999999996,3331.44,3531.3263999999999,3597.9552000000003,3664.5839999999998]
[409,299,0.75,0.79500000000000004,0.81,0.82499999999999996,3340.44,3540.8663999999999,3607.6752000000001,3674.4839999999999]
[410,300,0.75,0.79500000000000004,0.81,0.82499999999999996,3349.44,3550.4063999999998,3617.3952000000004,3684.384]
[411,301,0.75,0.79500000000000004,0.81,0.82499999999999996,3358.44,3559.9463999999998,3627.1152000000002,3694.2839999999997]
[412,302,0.75,0.79500000000000004,0.81,0.82499999999999996,3367.44,3569.4863999999998,3636.8352,3704.1839999999997]
[413,303,0.75,0.79500000000000004,0.81,0.82499999999999996,3376.44,3579.0264000000002,3646.5551999999998,3714.0839999999998]
[414,304,0.75,0.79500000000000004,0.81,0.82499999999999996,3385.44,3588.5663999999997,3656.2752,3723.9839999999999]
[415,305,0.75,0.79500000000000004,0.81,0.82499999999999996,3394.44,3598.1064000000001,3665.9952000000003,3733.884]
[416,306,0.75,0.79500000000000004,0.81,0.82499999999999996,3403.44,3607.6464000000001,3675.7152000000001,3743.7839999999997]
[417,307,0.75,0.79500000000000004,0.81,0.82499999999999996,3412.44,3617.1864,3685.4351999999999,3753.6839999999997]
[418,308,0.75,0.79500000000000004,0.81,0.82499999999999996,3421.44,3626.7264,3695.1552000000001,3763.5839999999998]
[419,309,0.75,0.79500000000000004,0.81,0.82499999999999996,3430.44,3636.2664,3704.8752000000004,3773.4839999999999]
[420,310,0.75,0.79500000000000004,0.81,0.82499999999999996,3439.44,3645.8063999999999,3714.5952000000002,3783.384]
[421,311,0.75,0.79500000000000004,0.81,0.82499999999999996,3448.44,3655.3463999999999,3724.3152,3793.2839999999997]
[422,312,0.75,0.79500000000000004,0.81,0.82499999999999996,3457.44,3664.8864000000003,3734.0352000000003,3803.1839999999997]
[423,313,0.75,0.79500000000000004,0.81,0.82499999999999996,3466.44,3674.4263999999998,3743.7552000000005,3813.0839999999998]
[424,314,0.75,0.79500000000000004,0.81,0.82499999999999996,3475.44,3683.9664000000002,3753.4751999999999,3822.9840000000004]
[425,315,0.75,0.79500000000000004,0.81,0.82499999999999996,3484.44,3693.5064000000002,3763.1952000000001,3832.884]
[426,316,0.75,0.79500000000000004,0.81,0.82499999999999996,3493.44,3703.0463999999997,3772.9151999999999,3842.7839999999997]
[427,317,0.75,0.79500000000000004,0.81,0.82499999999999996,3502.44,3712.5864000000001,3782.6352000000006,3852.6839999999997]
[428,318,0.75,0.79500000000000004,0.81,0.82499999999999996,3511.44,3722.1264000000001,3792.3552000000004,3862.5839999999998]
[429,319,0.75,0.79500000000000004,0.81,0.82499999999999996,3520.44,3731.6664000000001,3802.0752000000002,3872.4840000000004]
[430,320,0.75,0.79500000000000004,0.81,0.82499999999999996,3529.44,3741.2064,3811.7952000000005,3882.384]
[431,321,0.75,0.79500000000000004,0.81,0.82499999999999996,3538.44,3750.7464,3821.5151999999998,3892.2839999999997]
[432,322,0.75,0.79500000000000004,0.81,0.82499999999999996,{"$f":"G$119+$B441*C441*12","v":3547.44},3760.2864,3831.2352000000001,3902.1839999999997]
[433,323,0.75,0.79500000000000004,0.81,0.82499999999999996,3556.44,3769.8263999999999,3840.9551999999999,3912.0839999999998]
[434,324,0.75,0.79500000000000004,0.81,0.82499999999999996,3565.44,3779.3664000000003,3850.6751999999997,3921.9840000000004]
[435,325,0.75,0.79500000000000004,0.81,0.82499999999999996,3574.44,3788.9063999999998,3860.3951999999999,3931.884]
[436,326,0.75,0.79500000000000004,0.81,0.82499999999999996,3583.44,3798.4463999999998,3870.1152000000002,3941.7839999999997]
[437,327,0.75,0.79500000000000004,0.81,0.82499999999999996,3592.44,3807.9864000000002,3879.8352,3951.6839999999997]
[438,328,0.75,0.79500000000000004,0.81,0.82499999999999996,3601.44,3817.5263999999997,3889.5551999999998,3961.5839999999998]
[439,329,0.75,0.79500000000000004,0.81,0.82499999999999996,3610.44,3827.0663999999997,3899.2752,3971.4840000000004]
[440,330,0.75,0.79500000000000004,0.81,0.82499999999999996,3619.44,3836.6064000000001,3908.9952000000003,3981.384]
[441,331,0.75,0.79500000000000004,0.81,0.82499999999999996,3628.44,3846.1464000000005,3918.7152000000001,3991.2839999999997]
[442,332,0.75,0.79500000000000004,0.81,0.82499999999999996,3637.44,3855.6863999999996,3928.4351999999999,4001.1839999999997]
[443,333,0.75,0.79500000000000004,0.81,0.82499999999999996,3646.44,3865.2264,3938.1552000000001,4011.0839999999998]
[444,334,0.75,0.79500000000000004,0.81,0.82499999999999996,3655.44,3874.7664000000004,3947.8752000000004,4020.9840000000004]
[445,335,0.75,0.79500000000000004,0.81,0.82499999999999996,3664.44,3884.3063999999995,3957.5952000000002,4030.884]
[446,336,0.75,0.79500000000000004,0.81,0.82499999999999996,3673.44,3893.8463999999999,3967.3152,4040.7839999999997]
[447,337,0.75,0.79500000000000004,0.81,0.82499999999999996,3682.44,{"$f":"H$119+$B456*D456*12","v":3903.3864000000003},{"$f":"I$119+$B456*E456*12","v":3977.0352000000003},{"$f":"J$119+$B456*F456*12","v":4050.6839999999997}]
[448,338,0.75,0.79500000000000004,0.81,0.82499999999999996,3691.44,3912.9264000000003,3986.7552000000005,4060.5839999999998]
[449,339,0.75,0.79500000000000004,0.81,0.82499999999999996,3700.44,3922.4663999999998,3996.4752000000003,4070.4840000000004]
[450,340,0.75,0.79500000000000004,0.81,0.82499999999999996,3709.44,3932.0064000000002,4006.1952000000001,4080.384]
[451,341,0.75,0.79500000000000004,0.81,0.82499999999999996,3718.44,3941.5464000000002,4015.9152000000004,4090.2839999999997]
[452,342,0.75,0.79500000000000004,0.81,0.82499999999999996,3727.44,3951.0863999999997,4025.6352000000006,4100.1839999999993]
[453,343,0.75,0.79500000000000004,0.81,0.82499999999999996,3736.44,3960.6264000000001,4035.3552000000004,4110.0839999999998]
[454,344,0.75,0.79500000000000004,0.81,0.82499999999999996,3745.44,3970.1664000000001,4045.0752000000002,4119.9840000000004]
[455,345,0.75,0.79500000000000004,0.81,0.82499999999999996,3754.44,3979.7064,4054.7952000000005,4129.884]
[456,346,0.75,0.79500000000000004,0.81,0.82499999999999996,3763.44,3989.2464,4064.5151999999998,4139.7839999999997]
[457,347,0.75,0.79500000000000004,0.81,0.82499999999999996,3772.44,3998.7864,4074.2352000000001,4149.6839999999993]
[458,348,0.75,0.79500000000000004,0.81,0.82499999999999996,3781.44,4008.3263999999999,4083.9551999999999,4159.5839999999998]
[459,349,0.75,0.79500000000000004,0.81,0.82499999999999996,3790.44,4017.8664000000003,4093.6751999999997,4169.4840000000004]
[460,350,0.75,0.79500000000000004,0.81,0.82499999999999996,3799.44,4027.4063999999998,4103.3951999999999,4179.384]
[461,351,0.75,0.79500000000000004,0.81,0.82499999999999996,3808.44,4036.9463999999998,4113.1152000000002,4189.2839999999997]
[462,352,0.75,0.79500000000000004,0.81,0.82499999999999996,3817.44,4046.4864000000002,4122.8351999999995,4199.1839999999993]
[463,353,0.75,0.79500000000000004,0.81,0.82499999999999996,3826.44,4056.0263999999997,4132.5551999999998,4209.0839999999998]
[464,354,0.75,0.79500000000000004,0.81,0.82499999999999996,3835.44,4065.5663999999997,4142.2752,4218.9840000000004]
[465,355,0.75,0.79500000000000004,0.81,0.82499999999999996,3844.44,4075.1064000000001,4151.9952000000003,4228.884]
[466,356,0.75,0.79500000000000004,0.81,0.82499999999999996,3853.44,4084.6464000000005,4161.7152000000006,4238.7839999999997]
[467,357,0.75,0.79500000000000004,0.81,0.82499999999999996,3862.44,4094.1863999999996,4171.4351999999999,4248.6839999999993]
[468,358,0.75,0.79500000000000004,0.81,0.82499999999999996,3871.44,4103.7264000000005,4181.1552000000001,4258.5839999999998]
[469,359,0.75,0.79500000000000004,0.81,0.82499999999999996,3880.44,4113.2664000000004,4190.8752000000004,4268.4840000000004]
[470,360,0.75,0.79500000000000004,0.81,0.82499999999999996,3889.44,4122.8063999999995,4200.5951999999997,4278.384]
[471,361,0.75,0.79500000000000004,0.81,0.82499999999999996,3898.44,4132.3464000000004,4210.3152,4288.2839999999997]
[472,362,0.75,0.79500000000000004,0.81,0.82499999999999996,3907.44,4141.8864000000003,4220.0352000000003,4298.1839999999993]
[473,363,0.75,0.79500000000000004,0.81,0.82499999999999996,3916.44,4151.4264000000003,4229.7552000000005,4308.0839999999998]
[474,364,0.75,0.79500000000000004,0.81,0.82499999999999996,3925.44,4160.9664000000002,4239.4752000000008,4317.9840000000004]
[475,365,0.75,0.79500000000000004,0.81,0.82499999999999996,3934.44,4170.5064000000002,4249.1952000000001,4327.884]
[476,366,0.75,0.79500000000000004,0.81,0.82499999999999996,3943.44,4180.0464000000002,4258.9152000000004,4337.7839999999997]
[477,367,0.75,0.79500000000000004,0.81,0.82499999999999996,3952.44,4189.5864000000001,4268.6352000000006,4347.6839999999993]
[478,368,0.75,0.79500000000000004,0.81,0.82499999999999996,3961.44,4199.1264000000001,4278.3552,4357.5839999999998]
[479,369,0.75,0.79500000000000004,0.81,0.82499999999999996,3970.44,4208.6664000000001,4288.0752000000002,4367.4840000000004]
[480,370,0.75,0.79500000000000004,0.81,0.82499999999999996,3979.44,4218.2064,4297.7952000000005,4377.384]
[481,371,0.75,0.79500000000000004,0.81,0.82499999999999996,3988.44,4227.7464,4307.5152000000007,4387.2839999999997]
[482,372,0.75,0.79500000000000004,0.81,0.82499999999999996,3997.44,4237.2864,4317.2352000000001,4397.1839999999993]
[483,373,0.75,0.79500000000000004,0.81,0.82499999999999996,4006.44,4246.8263999999999,4326.9552000000003,4407.0839999999998]
[484,374,0.75,0.79500000000000004,0.81,0.82499999999999996,4015.44,4256.3664000000008,4336.6751999999997,4416.9840000000004]
[485,375,0.75,0.79500000000000004,0.81,0.82499999999999996,4024.44,4265.9063999999998,4346.3951999999999,4426.884]
[486,376,0.75,0.79500000000000004,0.81,0.82499999999999996,4033.44,4275.4463999999998,4356.1152000000002,4436.7839999999997]
[487,377,0.75,0.79500000000000004,0.81,0.82499999999999996,4042.44,4284.9864000000007,4365.8351999999995,4446.6839999999993]
[488,378,0.75,0.79500000000000004,0.81,0.82499999999999996,4051.44,4294.5263999999997,4375.5551999999998,4456.5839999999998]
[489,379,0.75,0.79500000000000004,0.81,0.82499999999999996,4060.44,4304.0663999999997,4385.2752,4466.4840000000004]
[490,380,0.75,0.79500000000000004,0.81,0.82499999999999996,4069.44,4313.6064000000006,4394.9952000000003,4476.384]
[491,381,0.75,0.79500000000000004,0.81,0.82499999999999996,4078.44,4323.1464000000005,4404.7152000000006,4486.2839999999997]
[492,382,0.75,0.79500000000000004,0.81,0.82499999999999996,4087.44,4332.6863999999996,4414.4351999999999,4496.1839999999993]
[493,383,0.75,0.79500000000000004,0.81,0.82499999999999996,4096.4400000000005,4342.2264000000005,4424.1552000000001,4506.0839999999998]
[494,384,0.75,0.79500000000000004,0.81,0.82499999999999996,4105.4400000000005,4351.7664000000004,4433.8752000000004,4515.9839999999995]
[495,385,0.75,0.79500000000000004,0.81,0.82499999999999996,4114.4400000000005,4361.3063999999995,4443.5951999999997,4525.884]
[496,386,0.75,0.79500000000000004,0.81,0.82499999999999996,{"$f":"G$119+$B505*C505*12","v":4123.4400000000005},4370.8464000000004,4453.3152,4535.7839999999997]
[497,387,0.75,0.79500000000000004,0.81,0.82499999999999996,4132.4400000000005,4380.3864000000003,4463.0352000000003,4545.6839999999993]
[498,388,0.75,0.79500000000000004,0.81,0.82499999999999996,4141.4400000000005,4389.9264000000003,4472.7552000000005,4555.5839999999998]
[499,389,0.75,0.79500000000000004,0.81,0.82499999999999996,4150.4400000000005,4399.4664000000002,4482.4752000000008,4565.4839999999995]
[500,390,0.75,0.79500000000000004,0.81,0.82499999999999996,4159.4400000000005,4409.0064000000002,4492.1952000000001,4575.384]

{"sheet":"Enamo-Tarif","index":11,"n_rows":7,"n_cols":10,"rows_kept":7,"cut":false,"hidden":true,"merged":[[1,0,3,1]]}
[null,null,null,null,null,null,null,null,"Tarif (brutto)","Tarif (brutto) inkl. Pauschalen"]
["Unterbrechbarer Tarif",null,"Arbeitspreis 06:00 – 22:00 Uhr [cent]",7,2.39,1.5,0.77700000000000002,11.667,14,{"$f":"I2+$I$7*100","v":24.646129032258063}]
[null,null,"Arbeitspreis 22:00 – 06:00 Uhr [cent]",5.6,2.39,1.5,0.77700000000000002,10.266999999999999,12.32,{"$f":"I3+$I$7*100","v":22.966129032258063}]
[null,null,"Grundpreis / Pauschale [€/a]",null,null,null,33,33,39.6]
[null,null,"Messleistung für 2. Zähler",null,null,null,null,24.9,{"$f":"H5*1.2","v":29.879999999999995}]
[null,null,null,null,null,null,null,null,{"$f":"SUM(I4:I5)","v":69.47999999999999}]
[null,null,null,null,null,null,null,null,{"$f":"I6/Eingabe!G21","v":0.10646129032258063}]

{"sheet":"topprodukte-elektro","index":12,"n_rows":63,"n_cols":36,"rows_kept":63,"cut":false,"hidden":true,"merged":[]}
["Marke",null,"Modellname",null,"Kaufpreis",null,"Reichweite mind.",null,"Verbrauch",null,"Spitzengeschwindigkeit",null,"Antriebssystem",null,null,null,null,"Leistung [kW]","max. Drehmoment [Nm]",null,"Batterien",null,null,"Energieinhalt [kWh]","Ladezyklen","der Batterie","Ladegerät",null,null,"Standardladezeit","[h]","Sitzplätze","Anmerkung"]
[null,null,null,null,"inkl. MWSt. [EUR]",null,"[km]",null,"[kWh/100 km]",null,"[km/h]"]
["TESLA",null,"Model S",null,65740,null,502,null,18,null,210,null,"Vierpoliger","Dreiphasen","wechselstrom-","Induktionsmotor","mit Kupferläufer",350,600,null,"Li-Ion",null,null,85,"k.A.",null,"Integriertes Ladegerät",null,null,8,null,"5 Sitzer","Erhältlich auch","mit 60 kWh","Batterie"]
["TESLA",null,"Roadster",null,100000,null,350,null,"k.A.",null,200,null,"3-Phasen","Asynchron",null,null,null,185,"k.A.",null,"Li-Ion",null,null,"k.A.","k.A.",null,"k.A.",null,null,4,null,"2 Sitzer"]
["RENAULT",null,"Zoe",null,20780,null,210,null,15,null,135,null,"fremderregter","Synchronmotor","Rekuperation der","bremsenergie",null,65,220,null,"Li-Ion",null,null,22,"k.A.",null,"Mietbatterie","in Fahrzeug","integriert",9,null,"5 Sitzer","Modelle:","Life, Zen,","Intens"]
["Fiat Umbau durch","MP Eco Drive","E-Ducato Kombi",null,108000,null,200,null,"k.A.",null,90,null,"asynchron mit","Wasserkühlung",null,null,null,140,"k.A.",null,"Li-Ion",null,null,62,"k.A.",null,"k.A.",null,null,8,null,"12 Sitzer"]
["NISSAN",null,"Leaf",null,23390,null,199,null,15,null,144,null,"E-Motor",null,null,null,null,90,254,null,"Li-Ion",null,null,24,"k.A.",null,"Mietbatterie","in Fahrzeug","integriert",8,null,"4 Sitzer","Modelle:","Visia,Acenta,","Tekna"]
["BMW",null,"BMW i3",null,35700,null,190,null,13,null,150,null,"E-synchron","motor",null,null,null,125,250,null,"Li-Ion",null,null,"k.A.","k.A.",null,"k.A.",null,null,6,null,"5 Sitzer"]
["RENAULT",null,"Kangoo",null,24360,null,170,null,16,null,130,null,"fremderregter","Synchronmotor",null,null,null,44,226,null,"Li-Ion",null,null,22,"k.A.",null,"Mietbatterie","in Fahrzeug","integriert",9,null,"2 Sitzer"]
["FORD",null,"Ford Focus Electric",null,39990,null,162,null,15,null,135,null,"k.A.",null,null,null,null,107,250,null,"Li-Ion",null,null,23,"k.A.",null,"Integriertes Ladegerät",null,null,7,null,"5 Sitzer"]
["VW",null,"E-up",null,25350,null,160,null,12,null,130,null,"Permanenterregte","Synchronmaschine","(PSM)",null,null,60,210,null,"Li-Ion",null,null,19,"k.A.",null,"Integriertes Ladegerät",null,null,7,null,"5 Sitzer"]
["CITROEN",null,"C Zero",null,27588,null,150,null,"k.A.",null,130,null,"Permanent-","magnet-","Synchronantrieb",null,null,49,180,null,"Li-Ion",null,null,16,"k.A.",null,"k.A.",null,null,6,null,330,"Modelle:","Attraction","Seduction"]
["MITSUBISHI",null,"i-MiEV",null,29500,null,150,null,"k.A.",null,130,null,"Permanent-","magnetischer","Synchronmotor",null,null,49,180,null,"Li-Ion",null,null,16,"k.A.",null,"k.A.",null,null,8,null,"4 Sitzer"]
["PEUGEOT",null,"i On",null,31800,null,150,null,14,null,130,null,"synchroner","E-Motor",null,null,null,49,180,null,"Li-Ion",null,null,16,"k.A.",null,"in Fahrzeug","eingebaut",null,9,null,"2 Sitzer"]
["SMART",null,"Smart fortwo","electronicdrive",19420,null,145,null,15,null,125,null,"Heck,","Permanent-","Magnet-Motor",null,null,55,130,null,"Li-Ion",null,null,"k.A.","k.A.",null,"k.A.",null,null,7,null,"2 Sitzer"]
["SMART",null,"Brabus",null,"k.A.",null,145,null,18,null,130,null,"Heck, Permanent","-Magnet-Motor",null,null,null,60,135,null,"Li-Ion",null,null,"k.A.","k.A.",null,"k.A.",null,null,7,null,"2 Sitzer"]
["TAZZARI",null,"Tazzari Zero",null,22560,null,140,null,9.1999999999999993,null,100,null,"Asynchron-","Drehstrommotor",null,null,null,15,150,null,"Li-Ion Fe",null,null,12.8,"k.A.",null,"k.A.",null,null,9,null,150,"Modelle:","classic, evo,","Speedster,","Anniversary"]
["STROMOS",null,"Coolcar Van",null,"k.A.",null,110,null,"k.A.",null,90,null,"k.A.",null,null,null,null,20,"k.A.",null,"Blei Gel",null,null,"k.A.","k.A.",null,"k.A.",null,null,8,null,"5 Sitzer"]
["RENAULT",null,"Twizy",null,6990,null,100,null,"5,8/6,1",null,"45/80",null,"Drehstrom","Rekuperation der","bremsenergie",null,null,3,"33-57",null,"Li-Ion",null,null,6,"k.A.",null,"Mietbatterie","in Fahrzeug","integriert",4,null,"2 Sitzer","Modelle:","Urban, Technic"]
["STROMOS",null,"Coolcar",null,"k.A.",null,90,null,"k.A.",null,90,null,"k.A.",null,null,null,null,20,"k.A.",null,"Blei Gel",null,null,"k.A.","k.A.",null,"k.A.",null,null,8,null,"4 Sitzer","Modell:","Indimo Coolcar"]
["NF",null,"Nano",null,"ab 18.500",null,90,null,"k.A.",null,43,null,"k.A.",null,null,null,null,3,"k.A.",null,"k.A.",null,null,"k.A.","k.A.",null,"k.A.",null,null,8,null,"2 Sitzer","Karosse aus","Kunststoff"]
["OPEL",null,"Ampera",null,38400,null,83,null,19,null,161,null,"E-Motor",null,null,null,null,111,130,null,"Li-Ion",null,null,16,"k.A.",null,"Integriertes Ladegerät",null,null,6,null,"5 Sitzer","Erweiterte Reichweite","durch eingebauten","Benzinmotor","als Stromgenerator"]
["CHEVROLET",null,"Volt",null,38000,null,80,null,17,null,160,null,"E-Motor",null,null,null,null,111,130,null,"Li-Ion",null,null,16,"k.A.",null,"Integriertes Ladegerät",null,null,6,null,"5 Sitzer","Erweiterte Reichweite","durch eingebauten","Benzinmotor","als Stromgenerator"]
["Estrima Biro",null,"Estrima Biro",null,8868,null,50,null,"k.A.",null,45,null,"k.A.",null,null,null,null,4,"k.A.",null,"Blei Gel",null,null,"k.A.","k.A.",null,"k.A.",null,null,"k.A.",null,"2 Sitzer"]
["Start Lab",null,"Start Lab",null,8300,null,50,null,13,null,45,null,"Gleichstrommotor",null,null,null,null,4,"Motorumdrehung","-4.100/3.500 U/min","Blei-Gel,","4x Northstar","NSB125","k.A.","k.A.",null,"Integriertes Ladegerät",null,null,7,null,"3 Sitzer"]
["MITSUBISHI",null,"Outlander PHEV",null,"k.A.",null,50,null,"k.A.",null,"k.A.",null,"Permanent","magnetischer","Synchronmotor",null,null,70,"137 vorne","195 hinten","Li-Ion",null,null,12,"k.A.",null,"Integriertes Ladegerät",null,null,4,null,"5 Sitzer","Plug-in-Hybrid","mit EV-System","(Benzimotor als","Generator)"]
[]
[]
[]
[]
[]
[]
[]
[]
[]
[]
[]
[]
[]
[]
[]
[]
[null,null,null,null,null,null,null,null,null,null,null,null,null,null,null,null,null,null,null,null,null,null,null,null,null,"Marke und"]
[null,null,null,null,null,null,null,null,null,null,null,null,null,null,null,null,null,null,null,null,null,null,null,null,null,"Modell anonymisiert"]
[null,null,null,null,null,null,null,null,null,null,null,null,null,null,null,null,null,null,null,null,null,null,null,null,null,"k.A."]
[]
[null,null,null,null,null,null,null,null,null,null,null,null,null,null,null,null,null,null,null,null,null,null,null,null,null,"k.A."]
[]
[]
[null,null,null,null,null,null,null,null,null,null,null,null,null,null,null,null,null,null,null,null,null,null,null,null,null,7.3]
[]
[null,null,null,null,null,null,null,null,null,null,null,null,null,null,null,null,null,null,null,null,null,null,null,null,null,171]
[]
[null,null,null,null,null,null,null,null,null,null,null,null,null,null,null,null,null,null,null,null,null,null,null,null,null,5]
[null,null,null,null,null,null,null,null,null,null,null,null,null,null,null,null,null,null,null,null,null,null,null,null,null,5]
[null,null,null,null,null,null,null,null,null,null,null,null,null,null,null,null,null,null,null,null,null,null,null,null,null,110]
[]
[null,null,null,null,null,null,null,null,null,null,null,null,null,null,null,null,null,null,null,null,null,null,null,null,null,150]
[]
[null,null,null,null,null,null,null,null,null,null,null,null,null,null,null,null,null,null,null,null,null,null,null,null,null,"M5"]
[null,null,null,null,null,null,null,null,null,null,null,null,null,null,null,null,null,null,null,null,null,null,null,null,null,"k.A."]
[null,null,null,null,null,null,null,null,null,null,null,null,null,null,null,null,null,null,null,null,null,null,null,null,null,"k.A."]
[null,null,null,null,null,null,null,null,null,null,null,null,null,null,null,null,null,null,null,null,null,null,null,null,null,"k.A."]

{"sheet":"topprodukte-benzin-diesel","index":13,"n_rows":182,"n_cols":36,"rows_kept":182,"cut":false,"hidden":true,"merged":[]}
["MARKE","Modell",null,"Motor",null,"Kaufpreis bei","Grundausstattung","[ab EUR] inkl MWSt.","Kraftstoff","Benzin/Diesel","CO2-Emissionen","[g/km]","EU-Abgasnorm","Sitzplätze","Leistung","[kW]","Leistung","[PS]","Getriebe","Länge [mm]","Breite mit Außenspiegel [mm]","Höhe ohne Dachreeling [mm]","andere Motoren","(Verbrauch, CO2-Emission,","Leistung [kW], Leistung [PS])",null,null,"Modellvarianten"]
["Audi","A1 SB","25 TSFI",null,null,21780,null,null,5.6,"Benzin",126,null,"6d-TEMP",4,70,null,95,null,"M5",3954,1906,1416,1110,"30 TSFI","(4.8,122,85,116)",null,"advanced,","S-line",null,null,"S-line"]
["Audi","A3 SB","30 TDI",null,null,29600,null,null,4.4000000000000004,"Benzin",114,null,"6d-TEMP",5,85,null,115,null,"M6",4313,1785,1426,1360,"35 TDI","(4.4,115,110,150)",null,null,"sport, design",null,null,null,null,null,null,"Auch als Combi","erhältlich"]
["Audi","A4 Limousine","30 TDI",null,null,36970,null,null,4.9000000000000004,"Benzin",128,null,"6d-TEMP",5,90,null,122,null,"M6",4762,2022,1428,1540,"35 TDI","(5.0,131,120,163)","40 TDI","(5.2,136,140,190)","advanced, S line",null,null,null,null,null,null,"Auch als Combi","erhältlich"]
["Audi","A3 SB","30 TDI",null,null,29600,null,null,4.4000000000000004,"Diesel",114,null,"6d-TEMP",5,85,null,115,null,"M6","4 313","1 785","1 426","1 360","35 TDI","(4.4,115,110,150)",null,null,"sport, design"]
["Audi","A4 Limousine","30 TDI",null,null,36970,null,null,4.9000000000000004,"Diesel",128,null,"6d-TEMP",5,90,null,122,null,"M6","4 762","2 022","1 428","1 540","35 TDI","(5.0,131,120,163)","40 TDI","(5.2,136,140,190)","advanced, S line",null,null,"erhältlich"]
["BMW","2er Gran Tourer","216i",null,null,31350,null,null,6.4,"Benzin",146,null,"6d-TEMP",5,80,null,109,null,"AMT6",4556,1800,1608,1515,"218i","(6.5,146,103,140)","220i","(6.8,154,141,192)"]
["BMW","1er Limousine","116d",null,null,31160,null,null,4.5,"Benzin",118,null,"6d",5,85,null,115,null,"M6",4319,1799,1434,1375,"118d","(4.7,122,11,150)"]
["BMW","3er Limousine","318d",null,null,38950,null,null,4.8,"Benzin",125,null,"6d-TEMP",5,110,null,150,null,"M6",4709,2068,1435,1520,"320d","(4.9,128,140,190)",null,null,null,null,null,"Kompakt-Van"]
["BMW","2er Active Tourer","216d",null,null,32050,null,null,4.7,"Benzin",123,null,"6d",5,85,null,116,null,"M6",4354,2039,1555,1495,"218d","(4.9,129,110,150)","220d","(5.1,134,140,190)",null,null,"Länge entspricht","Live",null,"Als 3-Türer oder","5-Türer erhältlich"]
["BMW","2er Gran Tourer","216d",null,null,33600,null,null,4.9000000000000004,"Benzin",128,null,"6d",5,85,null,116,null,"M6",4565,2038,1606,1560,"218d","(5.1,134,110,150)","220d","(5.3,140,140,190)",null,null,null,null,"Feel, Shine, Live"]
["BMW","1er Limousine","116d",null,null,31160,null,null,4.5,"Diesel",118,null,"6d",5,85,null,115,null,"M6","4 319","1 799","1 434","1 375","118d","(4.7,122,11,150)"]
["BMW","3er Limousine","318d",null,null,38950,null,null,4.8,"Diesel",125,null,"6d-TEMP",5,110,null,150,null,"M6","4 709","2 068","1 435","1 520","320d","(4.9,128,140,190)",null,null,null,null,null,null,null,"Auch als 7-Sitzer","erhältlich"]
["BMW","2er Active Tourer","216d",null,null,32050,null,null,4.7,"Diesel",123,null,"6d",5,85,null,116,null,"M6","4 354","2 039","1 555","1 495","218d","(4.9,129,110,150)","220d","(5.1,134,140,190)",null,null,"Länge entspricht"]
["Citroen","C1 ","VTi 72",null,null,11490,null,null,4.8,"Benzin",110,null,"6d-TEMP",4,53,null,72,null,"M5",3466,1884,1460,867,null,null,null,"Feel, Shine, Origins"]
["Citroen","C3","PureTech 82",null,null,13390,null,null,5.7,"Benzin",127,null,"6d-TEMP-EVAP",5,61,null,83,null,"M5",3996,2009,1490,1037,"PureTech 110","(5.8,131,81,110)",null,"Feel, Shine"]
["Citroen","C3 Aircross","PureTech 110","S&S",null,20320,null,null,6.2,"Benzin",141,null,"6d-TEMP-EVAP",5,81,null,110,null,"M6",4154,1976,1597,1247,"PureTech 130","(6.6,148,96,130)",null,null,"Feel, Shine, C-Series"]
["Citroen","Grand C4 Spacetourer","PureTech 130","Start&Stop",null,28550,null,null,6.3,"Benzin",143,null,"6d-TEMP-EVAP",7,96,null,131,null,"M6",4597,2117,1638,1423,null,null,null,null,"Feel, Shine"]
["Citroen","C5 Aircross","PureTech 130","Start&Stop",null,26690,null,null,6.6,"Benzin",149,null,"6d-TEMP",5,96,null,131,null,"M6",4500,2099,1654,1468,null,null,null,null,"Live, Feel",null,null,"Spacetourer erhältlich"]
["Citroen","C4 Cactus","BlueHDi 100","S&S",null,20275,null,null,4.5,"Benzin",118,null,"6d-TEMP",5,75,null,102,null,"M6",4170,1979,1480,1148,"BlueHDi 120","(5.0, 130, 88, 120)",null,null,"Feel, Shine"]
["Citroen","C3 Aircross","Blue HDi 100","S&S",null,20790,null,null,4.7,"Benzin",123,null,"6d-TEMP",5,75,null,102,null,"M6",4154,1976,1597,1292,"Blue HDi 120","(5.2,137,88,120)",null,null,"Feel, Shine"]
["Citroen","C4 Spacetourer","BlueHDi 130","Start&Stop",null,28400,null,null,5,"Benzin",130,null,"6d-TEMP",5,96,null,130,null,"M6",4438,1826,1610,1410,null,null,null,null,"Feel",null,null,null,"Ambiance, Supreme"]
["Citroen","C5 Aircross","BlueHDi 130","Start&Stop",null,29390,null,null,5.2,"Benzin",138,null,"6d-TEMP",5,96,null,130,null,"M6",4500,1969,1654,1507,null,null,null,null,"Live, Feel,","Shine, C-Series"]
["Citroen","C3","BlueHDi 100","Start&Stop",null,18290,null,null,4.5,"Diesel",117,null,"6d-TEMP",5,75,null,102,null,"M5",3996,2009,1474,1146,null,null,null,"Feel, Shine"]
["Citroen","C4 Cactus","BlueHDi 100","S&S",null,20275,null,null,4.5,"Diesel",118,null,"6d-TEMP",5,75,null,102,null,"M6","4 170","1 979","1 480","1 148","BlueHDi 120","(5.0, 130, 88, 120)",null,null,"Feel, Shine"]
["Citroen","C3 Aircross","Blue HDi 100","S&S",null,20790,null,null,4.7,"Diesel",123,null,"6d-TEMP",5,75,null,102,null,"M6","4 154","1 976","1 597","1 292","Blue HDi 120","(5.2,137,88,120)",null,null,"Feel, Shine",null,null,"erhältlich"]
["Dacia","Logan MCV","SCe 75 S&S",null,null,8590,null,null,5.7,"Benzin",129,null,"6d-TEMP",5,54,null,73,null,"M5",4501,1994,1521,1112,"TCe 90 S&S","(5.9,133,66,90)",null,null,null,null,"Access, Essential,","Performance Line"]
["Dacia","Sandero","SCe 75",null,null,7790,null,null,5.7,"Benzin",129,null,"6d-TEMP",5,54,null,73,null,"M5",4069,1994,1555,1052,"TCe 90","(5.9,133,66,90)",null,null,"Access, Essential,","Comfort, Stepway,","Celebration"]
["Dacia","Duster","TCe 100",null,null,12990,null,null,6.1,"Benzin",138,null,"6d-TEMP",5,74,null,100,null,"M5",4341,2052,1693,1191,"TCe 130","(6.6,149,96,130)","TCe 150","(7.1,162,110,150)","Access, Comfort,","Essential, Prestige,","Celebration","Mirror, Lounge, Pop"]
["Dacia","Sandero","Blue dCi 75","S&S",null,11340,null,null,4.4000000000000004,"Benzin",116,null,"6d-TEMP",5,55,null,75,null,"M5",4069,1994,1555,1190,"dCi 95","(4.4,116,70,95)",null,null,"Comfort, Stepway,","Celebration"]
["Dacia","Lodgy","Blue dCi 95",null,null,15350,null,null,4.8,"Benzin",126,null,"6d-TEMP",5,70,null,95,null,"M6",4498,2004,1682,1263,"Blue dCi 115","(4.8,126,85,115)",null,null,"Supreme, Stepway"]
["Dacia","Duster","Blue dCi 95",null,null,15490,null,null,4.9000000000000004,"Benzin",128,null,"6d-TEMP",5,70,null,95,null,"M6",4341,2052,1693,1314,"Blue dCi 115","(4.9,128,85,115)",null,null,"Essential, Comfort,","Prestige, Celebration"]
["Dacia","Dokker","Blue dCi 95",null,null,14250,null,null,5,"Benzin",132,null,"6d-TEMP",5,70,null,95,null,"M6",4363,2004,1804,1368,null,null,null,null,"Supreme, Stepway"]
["Dacia","Sandero","Blue dCi 75","S&S",null,11340,null,null,4.4000000000000004,"Diesel",116,null,"6d-TEMP",5,55,null,75,null,"M5","4 069","1 994","1 555","1 190","dCi 95","(4.4,116,70,95)",null,null,"Comfort, Stepway,","Celebration",null,"(4.9,112,103,140)","Trend, Titanium,","ST-Line, Vignale",null,"Auch als 5-Türer","erhältlich"]
["DS Automobiles","DS 7","BlueHDi 130",null,null,41290,null,null,5.2,"Benzin",136,null,"6d-TEMP",5,96,null,130,null,"A8",4573,2098,1625,1527,"BlueHDI 180","(6.1,161,130,180)",null,null,"Be Chic, So Chic,","Performance Line",null,null,"Trend, Titanium,","Active, ST-Line,","Vignale","Auch als Kombi","erhältlich "]
["Fiat",500,"1.2 Fire 70","Dualogic",null,18170,null,null,5.5,"Benzin",135,null,"6d-TEMP-EVAP",4,51,null,69,null,"A5",3571,1627,1488,900,null,null,null,"500C, 500S","Lounge, Sport","Star, Rockstar","Hybrid-Variante","(5.5,125,134,182)","Trend, Titanium,","ST-Line, Vignale"]
["Fiat","Panda","1.2 Fire 70",null,null,12100,null,null,5.7,"Benzin",133,null,"6d-TEMP-EVAP-ISC",4,51,null,69,null,"M5",3653,1882,1551,980,null,null,null,null,"Easy, Lounge",null,null,"Kompakt-Van"]
["Fiat","Tipo Kombi","MultiJet 95 SCR",null,null,21170,null,null,4.5999999999999996,"Benzin",120,null,"6d-TEMP-EVAP",5,70,null,95,null,"M5",4571,1792,1514,1395,"MultiJet 120 SCR","(5.1,130,88,120)",null,null,"Street, Mirror,","Lounge, S-Design",null,"Kompakt-Van"]
["Fiat","500X Urban","1.6 MultiJet","95 SCR",null,22100,null,null,4.8,"Benzin",126,null,"6d-TEMP-EVAP-ISC",5,70,null,95,null,"M5",4264,2025,1595,1320,"1.6 MultiJet","(5.2,137,88,120)",null,null,"Lounge, Cross, Sport",null,"Länge entspricht","Titanium"]
["Fiat","Tipo Kombi","MultiJet 95 SCR",null,null,21170,null,null,4.5999999999999996,"Diesel",120,null,"6d-TEMP-EVAP",5,70,null,95,null,"M5","4 571","1 792","1 514","1 395","MultiJet 120 SCR","(5.1,130,88,120)",null,null,"Street, Mirror,","Lounge, S-Design"]
["Fiat","500X Urban","1.6 MultiJet","95 SCR",null,22100,null,null,4.8,"Diesel",126,null,"6d-TEMP-EVAP-ISC",5,70,null,95,null,"M5","4 264","2 025","1 595","1 320","1.6 MultiJet","(5.2,137,88,120)",null,null,"Lounge, Cross, Sport",null,"Länge entspricht"]
["Ford","Fiesta Coupe","1.0 Ecoboost","Start&Stop",null,15300,null,null,5.0999999999999996,"Benzin",115,null,"6d-TEMP-EVAP-ISC",5,70,null,95,null,"M6",4065,1941,1466,1163,"1.1l","(5.3,120,55,75)","1.0 Ecoboost","(5.1,115,70,95)","1.0 Ecoboost","(5.6,127,92,125)","Trend, Cool-Connect,","erhältlich"]
["Ford","Focus","1.0 EcoBoost",null,null,22100,null,null,5.3,"Benzin",119,null,"6d-TEMP-EVAP-ISC",5,74,null,100,null,"M6",4378,1979,1471,1322,"1.0 EcoBoost","(5.5, 124, 92, 125)","1.0 EcoBoost","(5.9,133,92,125)","1.5 EcoBoost","(6.3,142,110,150)","Trend, Titanium,"]
["Ford","Focus Turnier","1.0 EcoBoost",null,null,23600,null,null,5.3,"Benzin",119,null,"6d-TEMP-EVAP-ISC",5,74,null,100,null,"M6",4668,1979,1494,1383,"1.0 EcoBoost","(5.6,126,92,125)","1.5 EcoBoost","(5.8,132,110,150)","1.5 EcoBoost","(6.0,137,134,182)","Trend, Titanium,","Kompakt-Van"]
["Ford","EcoSport","1.0 EcoBoost",null,null,20300,null,null,5.9,"Benzin",134,null,"6d-TEMP-EVAP-ISC",5,74,null,100,null,"M6",4096,2057,1653,1349,"1.0 EcoBoost","(6.0,135,92,125)","1.0 EcoBoost","(6.0,136,103,140)","ST-Line, Trend","Titanium,","Cool & Connect","Kompakt-Van"]
["Ford","Fiesta","1.5 TDCi","Start&Stop",null,16650,null,null,4.2,"Benzin",111,null,"6d-TEMP-EVAP-ISC",5,63,null,85,null,"M6",4040,1735,1476,1194,null,null,null,null,"Trend, Titanium","Cool&Connect,","ST-Line",null,"Comfort, Elegance,","Executive, Dynamic,","Sport"]
["Ford","Focus","1.5 l EcoBlue",null,null,23650,null,null,4.5,"Benzin",117,null,"6d-TEMP-EVAP-ISC",5,70,null,95,null,"M6",4378,1825,1454,1363,"1.5 EcoBlue","(4.5,117,88,120)","2.0 EcoBlue","(4.7,124,110,150)","Trend, Titanium","ST-Line, Vignale,","Active,","Executive"]
["Ford","Puma","1.5 l EcoBlue",null,null,25890,null,null,4.5,"Benzin",118,null,"6d-TEMP-EVAP-ISC",5,88,null,120,null,"M6",4186,1930,1536,1280,null,null,null,null,"Titanium, ST-Line"]
["Ford","Focus Turnier","1.5 EcoBlue",null,null,25150,null,null,4.5,"Benzin",119,null,"6d-TEMP-EVAP-ISC",5,70,null,95,null,"M6",4668,1979,1494,1413,"1.5 EcoBlue","(4.5,119,88,120)","2.0 EcoBlue","(4.7,124,110,150)","Trend, Titanium,","ST-Line, Vignale,","Active,",null,"Level 1,2,3,4,5",null,null,"Auch als 3-Türer","erhältlich"]
["Ford","Mondeo","2.0l EcoBlue SCR",null,null,34100,null,null,4.9000000000000004,"Benzin",128,null,"6d-TEMP",5,88,null,120,null,"M6",4871,2121,1482,1707,"2.0l EcoBlue","(5.0,131,110,150)","2.0l EcoBlue","(5.3,140,140,190)","Trend, Titanium,","ST-Line, Vignale",null,null,"Level 2,3,4,5,6"]
["Ford","EcoSport","1.5 l EcoBlue",null,null,23700,null,null,4.9000000000000004,"Benzin",129,null,"6d-TEMP-EVAP-ISC",5,74,null,100,null,"M6",4096,2057,1653,1395,"1.5 EcoBlue","(5.3,138,88,120)",null,null,"ST-Line, Titanium","Cool&Connect","Höhe entspricht"]
["Ford","Tourneo Courier","1.5 TDCi S&S",null,null,18142,null,null,5.4,"Benzin",141,null,"6d-TEMP-EVAP-ISC",5,55,null,75,null,"M6",4157,2112,1741,1420,"1.5 TDCi SS","(5.5,144,74,101)",null,null,"Trend, Titanium, Sport",null,"Höhe entspricht"]
["Ford","Fiesta","1.5 TDCi","Start&Stop",null,16650,null,null,4.2,"Diesel",111,null,"6d-TEMP-EVAP-ISC",5,63,null,85,null,"M6","4 040","1 735","1 476","1 194",null,null,null,null,"Trend, Titanium","Cool&Connect,","ST-Line","erhältlich"]
["Ford","Focus","1.5 l EcoBlue",null,null,23650,null,null,4.5,"Diesel",117,null,"6d-TEMP-EVAP-ISC",5,70,null,95,null,"M6","4 378","1 825","1 454","1 363","1.5 EcoBlue","(4.5,117,88,120)","2.0 EcoBlue","(4.7,124,110,150)","Trend, Titanium","ST-Line, Vignale,","Active,"]
["Ford","Puma","1.5 l EcoBlue",null,null,25890,null,null,4.5,"Diesel",118,null,"6d-TEMP-EVAP-ISC",5,88,null,120,null,"M6","4 186","1 930","1 536","1 280",null,null,null,null,"Titanium, ST-Line"]
["Ford","Focus Turnier","1.5 EcoBlue",null,null,25150,null,null,4.5,"Diesel",119,null,"6d-TEMP-EVAP-ISC",5,70,null,95,null,"M6","4 668","1 979","1 494","1 413","1.5 EcoBlue","(4.5,119,88,120)","2.0 EcoBlue","(4.7,124,110,150)","Trend, Titanium,","ST-Line, Vignale,","Active,",null,"Gold, Silber,","Titan, Platin",null,"Auch als Kombi","erhältlich "]
["Ford","Mondeo","2.0l EcoBlue SCR",null,null,34100,null,null,4.9000000000000004,"Diesel",128,null,"6d-TEMP",5,88,null,120,null,"M6","4 871","2 121","1 482","1 707","2.0l EcoBlue","(5.0,131,110,150)","2.0l EcoBlue","(5.3,140,140,190)","Trend, Titanium,","ST-Line, Vignale",null,null,"Gold, Silber","Titan, Platin"]
["Ford","EcoSport","1.5 l EcoBlue",null,null,23700,null,null,4.9000000000000004,"Diesel",129,null,"6d-TEMP-EVAP-ISC",5,74,null,100,null,"M6","4 096","2 057","1 653","1 395","1.5 EcoBlue","(5.3,138,88,120)",null,null,"ST-Line, Titanium","Cool&Connect","Höhe entspricht"]
["Ford","Tourneo Courier","1.5 TDCi S&S",null,null,18142,null,null,5.4,"Diesel",141,null,"6d-TEMP-EVAP-ISC",5,55,null,75,null,"M6","4 157","2 112","1 741","1 420","1.5 TDCi SS","(5.5,144,74,101)",null,null,"Trend, Titanium, Sport",null,"Höhe entspricht"]
["Honda","Civic","1.0 VTEC","Turbo",null,22890,null,null,5.7,"Benzin",128,null,"6d-TEMP",5,93,null,126,null,"M6",4518,2076,1434,1229,"1.5 VTEC Turbo","(6.1,139,134,182)",null,null,null,null,"Comfort, Elegance,","erhältlich"]
["Honda","HR-V","1,5 i-VTEC",null,null,23290,null,null,6.6,"Benzin",148,null,"6d-TEMP",5,96,null,131,null,"M6",4294,1772,1605,1243,null,null,null,null,"Comfort, Elegance,","Executive",null,null,"Attraction","Takumi, Revolution"]
["Honda","Civic","1.6i-DTEC",null,null,24390,null,null,4.5999999999999996,"Benzin",121,null,"6d-TEMP",5,88,null,120,null,"M6",4518,2079,1434,1342,null,null,null,null,"Elegance, Executive,","S, Comfort"]
["Honda","HR-V","1.6 i-DTEC",null,null,25790,null,null,5,"Benzin",132,null,"6d-TEMP",5,88,null,120,null,"M6",4294,1772,1689,1395,null,null,null,null,"Comfort. Elegance,","Executive",null,null,null,null,null,"Auch als Combi","erhältlich"]
["Honda","Civic","1.6i-DTEC",null,null,24390,null,null,4.5999999999999996,"Diesel",121,null,"6d-TEMP",5,88,null,120,null,"M6","4 518","2 079","1 434","1 342",null,null,null,null,"Elegance, Executive,","S, Comfort"]
["Hyundai","i10","1.0l",null,null,10990,null,null,4.8,"Benzin",110,null,"6d-TEMP-EVAP",4,49,null,67,null,"M5",3670,1680,1480,924,"1.2l (5.2,117,62,84)",null,null,"Level 1,2,3,4",null,null,"Auch als 5-Sitzer","erhältlich"]
["Hyundai","i20","1.0 T-GDI",null,null,17190,null,null,5.5,"Benzin",126,null,"6d-TEMP-EVAP",5,74,null,100,null,"M5",4035,1734,1474,1065,"1.25l","(5.9,133,55,75)","1.25l","(5.8,132,62,84)","1.0 TGDI","(5.6,137,88,120)","Level 1,2,3,4,5"]
["Hyundai","i30 Combi","1.0 T-GDI",null,null,20590,null,null,5.4,"Benzin",123,null,"6d-TEMP-EVAP",5,88,null,120,null,"M6",4585,2039,1465,1231,"1.5 DPI","(6.0,137,81,110)",null,null,null,null,"Level 2,3,4,5,6"]
["Hyundai","Kona","1.0 T-GDi",null,null,20690,null,null,6.2,"Benzin",142,null,"6d-TEMP-EVAP",5,88,null,120,null,"M6",4165,2070,1550,1223,null,null,null,null,"Level 2,3,4,6",null,null,"Kompakt-Van"]
["Hyundai","i30","1.6 CRDi",null,null,22590,null,null,4.5999999999999996,"Benzin",118,null,"6d-TEMP-EVAP",5,85,null,115,null,"M6",4340,1795,1455,1313,null,null,null,null,"Level 2,3,4,5,6",null,null,"Invite Connect"]
["Hyundai","i30 CW","1.6 CRDi",null,null,22590,null,null,4.5,"Benzin",118,null,"6d-TEMP-EVAP",5,85,null,116,null,"M6",4585,2039,1465,1370,"1.6 CRDi","(4.6,120,100,136)",null,null,"Level 2,3,4,5,6"]
["Hyundai","Kona","1.6 CRDi",null,null,22690,null,null,5,"Benzin",129,null,"6d-TEMP-EVAP",5,85,null,116,null,"M6",4165,2070,1550,1318,"1.6 CRDi","(5.1,134,100,136)",null,null,"Level 2,3,4,6"]
["Hyundai","i30","1.6 CRDi",null,null,22590,null,null,4.5999999999999996,"Diesel",118,null,"6d-TEMP-EVAP",5,85,null,115,null,"M6","4 340","1 795","1 455","1 313",null,null,null,null,"Level 2,3,4,5,6",null,null,null,"Edition, Dynamic","Innovation",null,"Auch als Kombi","erhältlich "]
["Hyundai","i30 CW","1.6 CRDi",null,null,22590,null,null,4.5,"Diesel",118,null,"6d-TEMP-EVAP",5,85,null,116,null,"M6","4 585","2 039","1 465","1 370","1.6 CRDi","(4.6,120,100,136)",null,null,"Level 2,3,4,5,6",null,null,null,"Edition, Dynamic,","Innovation"]
["Hyundai","Kona","1.6 CRDi",null,null,22690,null,null,5,"Diesel",129,null,"6d-TEMP-EVAP",5,85,null,116,null,"M6","4 165","2 070","1 550","1 318","1.6 CRDi","(5.1,134,100,136)",null,null,"Level 2,3,4,6",null,null,null,"Edition, Dynamic,","Innovation,","Ultimate","Auch als Combi","erhältlich"]
["KIA","Picanto","1.0 MPI ISG",null,null,10190,null,null,5.0999999999999996,"Benzin",116,null,"6d-TEMP-EVAP",4,49,null,67,null,"M5",3595,1595,1485,588,"1.2 MPI ISG","(5.6,126,62,84)",null,"Neon, Titan, Silber,","Gold, GT-Line, X-Line",null,"Auch als 5-Sitzer","Edition, Ultimate","Innovation"]
["KIA","Rio","1.0 TGDI GPF ISG",null,null,18090,null,null,5.5,"Benzin",126,null,"6d-TEMP-EVAP",5,74,null,100,null,"M5",4065,1725,1450,1080,"1.25 MPI ISG","(5.8,132,62,84)","1.0 TGDI GPF ISG","(5.8,133,88,120)",null,null,"Neon, Titan, Silber,","Edition, Ultimate","Innovation"]
["KIA","Ceed","1.0 TGDI GPF ISG",null,null,17790,null,null,5.6,"Benzin",126,null,"6d-TEMP-EVAP",5,74,null,100,null,"M6",4310,1800,1447,1222,"1.0 TGDI GPF ISG","(5.6,126,88,120)","1.4 TGDI GPF ISG","(5.9,135,103,140)",null,null,"Titan, Silber,Gold","Innovation"]
["KIA","Ceed SW","1.0 TGDI GPF ISG",null,null,18990,null,null,5.6,"Benzin",127,null,"6d-TEMP-EVAP",5,74,null,100,null,"M6",4600,1800,1465,1259,"1.4 TGDI ISG","(5.9,135,103,140)",null,null,null,null,"Titan, Silber, Gold,"]
["KIA","ceed SW","1.6 CRDi ISG",null,null,22790,null,null,4.5999999999999996,"Benzin",121,null,"6d-TEMP-EVAP",5,85,null,116,null,"M6",4600,1800,1465,1350,"1.6 CRDi ISG","(4.8,125,100,136)",null,null,"Gold, Silber","Titan, Platin,","GT-Line"]
["KIA","Sportage","1.6 CRDI SCR",null,null,31190,null,null,5.3,"Benzin",135,null,"6d-TEMP-EVAP",5,85,null,116,null,"M6",4485,1855,1635,1534,"1.6 CRDI SCR","(5.4,141,100,136)",null,null,"Titan, Silber,","Gold, Platin,","GT-Line"]
["KIA","ceed SW","1.6 CRDi ISG",null,null,22790,null,null,4.5999999999999996,"Diesel",121,null,"6d-TEMP-EVAP",5,85,null,116,null,"M6","4 600","1 800","1 465","1 350","1.6 CRDi ISG","(4.8,125,100,136)",null,null,"Gold, Silber","Titan, Platin,","GT-Line"]
["Mazda",2,"G75 Life",null,null,14690,null,null,5.3,"Benzin",120,null,"6d",5,55,null,75,null,"M6",4070,1695,1495,1100,"G90","(5.3,120,66,90)",null,null,null,null,"Life, Takumi,"]
["Mercedes","A-Klasse","A 180",null,null,29670,null,null,5.9,"Benzin",133,null,"6d ISC-FCM",5,100,null,136,null,"M6",4549,1796,1446,1360,"A 200","(5.8,131,120,163)"]
["Mercedes","A-Klasse","160 d",null,null,29590,null,null,4.5,"Benzin",118,null,"6d-TEMP-EVAP-ISC",5,70,null,95,null,"M6",4419,1796,1440,1425,"A180d","(4.5,118,85,116)","A200d","(4.8,125,110,150)",null,null,null,"GT-Line, Signature"]
["Mercedes","CLA-Klasse","180 d",null,null,35460,null,null,4.5,"Benzin",118,null,"6d-TEMP-EVAP-ISC",5,85,null,116,null,"M6",4688,1830,1439,1470,"200d","(4.8,125,110,150)","220d","(4.8,127,140,190)",null,null,null,null,"Active, Style, GT-Line","Access, Allure",null,"Auch als Kombi","erhältlich "]
["Mercedes","C-Klasse","200 d",null,null,40470,null,null,4.8,"Benzin",127,null,"6d-ISC-FCM",5,118,null,160,null,"M6",4686,1810,1442,1555,"180d","(5.0,130,90,122)","220d","(5.0,132,143,194)",null,null,null,null,"Active, Style,","Access, Allure"]
["Mercedes","A-Klasse","160 d",null,null,29590,null,null,4.5,"Diesel",118,null,"6d-TEMP-EVAP-ISC",5,70,null,95,null,"M6","4 419","1 796","1 440","1 425","A180d","(4.5,118,85,116)","A200d","(4.8,125,110,150)",null,null,null,null,"Active, Allure,","GT Line",null,"Auch als Combi","erhältlich"]
["Mercedes","CLA-Klasse","180 d",null,null,35460,null,null,4.5,"Diesel",118,null,"6d-TEMP-EVAP-ISC",5,85,null,116,null,"M6","4 688","1 830","1 439","1 470","200d","(4.8,125,110,150)","220d","(4.8,127,140,190)"]
["Mercedes","C-Klasse","200 d",null,null,40470,null,null,4.8,"Diesel",127,null,"6d-ISC-FCM",5,118,null,160,null,"M6","4 686","1 810","1 442","1 555","180d","(5.0,130,90,122)","220d","(5.0,132,143,194)",null,null,null,"Access, GT Line,","Crossway","Auch als 7-Sitzer","erhältlich"]
["Mini","Mini 3-Türer","One First",null,null,19750,null,null,5.8,"Benzin",133,null,"6d-TEMP",4,55,null,75,null,"M6",3821,1727,1414,1215,"One (5.0,114,75,102),","Cooper","(5.0,115,100,136)","Salt, Pepper, Chili",null,null,"Auch als 5-Türer","Access, GT Line,","Crossway","Auch als 7-Sitzer","erhältlich"]
["Mini","Countryman","One",null,null,28500,null,null,4.9000000000000004,"Benzin",129,null,"6d-TEMP",5,85,null,116,null,"M6",4299,1822,1557,1505,"Cooper D","(5.0,130,110,150)","Cooper SD","(5.3,139,140,190)","One, Cooper",null,"Länge entspricht"]
["Mini","Countryman","One",null,null,28500,null,null,4.9000000000000004,"Diesel",129,null,"6d-TEMP",5,85,null,116,null,"M6","4 299","1 822","1 557","1 505","Cooper D","(5.0,130,110,150)","Cooper SD","(5.3,139,140,190)","One, Cooper",null,"Länge entspricht"]
["MItsubishi","Space Star","1.0 MIVEC AS&G",null,null,12990,null,null,5.0999999999999996,"Benzin",115,null,"6d-TEMP",5,52,null,71,null,"M5",3795,1665,1505,870,"1.2 MIVEC AS&G","(5.3, 121, 59, 80)",null,"Inform,","Invite Connect"]
["Nissan","Micra","1.0 IGT 100",null,null,15090,null,null,5.6,"Benzin",126,null,"6d-TEMP",5,74,null,100,null,"M5",3999,1935,1455,1135,"DIG-T 117","(5.9,133,86,117)",null,"Visia, Acenta, Tekna,","N-Connecta,","Visia Plus"]
["Nissan","Juke","DIG-T 117",null,null,19600,null,null,5.9,"Benzin",135,null,"6d-TEMP",5,86,null,117,null,"M6",4210,1983,1595,1182,null,null,null,null,"Visia, Acenta,","N-Connecta, Tekna,","N-Design","erhältlich"]
["Opel","Astra","1.2 Turbo","Direct Injection",null,21739,null,null,5.2,"Benzin",119,null,"6d",5,81,null,110,null,"M6",4370,2042,1485,1280,"1.2 TDI","(5.3,120,96,130)","1.2 TDI","(5.3,120,107,145)",null,null,"Edition, GS-Line,"]
["Opel","Corsa","1.2l",null,null,14999,null,null,5.4,"Benzin",123,null,"6d",5,55,null,75,null,"M5",4060,1960,1433,1055,"1.2 (5.5,124,74,100)","1.2 (5.6,128,96,130)",null,null,null,null,"Edition, Elegance,"]
["Opel","Astra ST","1.2 Turbo","Direct Injection",null,23339,null,null,5.4,"Benzin",122,null,"6d",5,81,null,110,null,"M6",4702,2040,1510,1355,"1.2 TDI","(5.4,122,96,130)","1.2 TDI","(5.4,122,107,145)",null,null,"Edition, GS Line,","erhältlich"]
["Opel","Insignia","1.5 Turbo","Direct Injection",null,30730,null,null,6.1,"Benzin",138,null,"6d-TEMP",5,103,null,140,null,"M6",4897,2093,1455,1441,"1.5 TDI","(6.1,138,121,165)",null,null,null,null,"Edition, Dynamic,"]
["Opel","Crossland X","1.2l",null,null,19839,null,null,6.2,"Benzin",139,null,"6d",5,60,null,81,null,"M5",4212,1976,1605,1174,"1.2 Turbo","(6.1,138,81,110)","1.2 Turbo","(5.9,134,96,130)","Edition, Ultimate","Innovation",null,"Allure",null,"Als 3-Türer oder","5-Türer erhältlich"]
["Opel","Grandland X","1.2 Turbo",null,null,26729,null,null,6.4,"Benzin",145,null,"6d",5,96,null,130,null,"M6",4477,2098,1609,1350,"1.6 Turbo","(7.2,163,133,181)",null,null,"Edition, Ultimate","Innovation",null,"Limited,","La Parisienne","Höhe entspricht","Micro-Van"]
["Opel","Corsa",44317,null,null,20389,null,null,4.0999999999999996,"Benzin",107,null,"6d-TEMP",5,75,null,102,null,"M6",4060,1960,1433,1165,null,null,null,null,"Edition, GS-Line,","Elegance",null,null,"Zen, Limited,","Intens, Life",null,"Auch als Kombi","erhältlich "]
["Opel","Astra","1.5 CDTI",null,null,23739,null,null,4.3,"Benzin",112,null,"6d",5,77,null,105,null,"M6",4370,2042,1485,1371,"1.5 CDTI","(4.4,116,90,122)",null,null,"Edition, GS-Line,","Elegance, Ultimate",null,null,"Intens, Life, Bose","GT-Line"]
["Opel","Astra Sports Tourer","1.5 CDTI",null,null,25339,null,null,4.3,"Benzin",113,null,"6d",5,77,null,105,null,"M6",4702,2042,1485,1395,"1.5 CDTI","(4.4,116,90,122)",null,null,"Astra, Edition,","GS Line, Elegance,","Ultimate"]
["Opel","Insignia ","1.5 CDTI",null,null,32699,null,null,4.5999999999999996,"Benzin",121,null,"6d-TEMP",5,90,null,122,null,"M6",4897,2093,1455,1503,"2.0 CDTI","(4.7,122,128,174)",null,null,"Edition, Business","Elegance",null,null,null,"Auch als Grand","Scenic erhältlich"]
["Opel","Crossland X","1.5 CDTI",null,null,22349,null,null,4.7,"Benzin",123,null,"6d-TEMP",5,75,null,102,null,"M6",4212,1976,1605,1289,"1.5 CDTI","(5.2,137,88,120)",null,null,"Edition, Innovation,","Ultimate",null,"Grandtour erhältlich"]
["Opel","Grandland X","1.5 CDTI",null,null,29309,null,null,5.2,"Benzin",136,null,"6d-TEMP",5,96,null,130,null,"M6",4477,2098,1609,1435,null,null,null,null,"Edition, Innovation,","Ultimate"]
["Opel","Corsa",44317,null,null,20389,null,null,4.0999999999999996,"Diesel",107,null,"6d-TEMP",5,75,null,102,null,"M6","4 060","1 960","1 433","1 165",null,null,null,null,"Edition, GS-Line,","Elegance"]
["Opel","Astra","1.5 CDTI",null,null,23739,null,null,4.3,"Diesel",112,null,"6d",5,77,null,105,null,"M6","4 370","2 042","1 485","1 371","1.5 CDTI","(4.4,116,90,122)",null,null,"Edition, GS-Line,","Elegance, Ultimate"]
["Opel","Astra Sports Tourer","1.5 CDTI",null,null,25339,null,null,4.3,"Diesel",113,null,"6d",5,77,null,105,null,"M6","4 702","2 042","1 485","1 395","1.5 CDTI","(4.4,116,90,122)",null,null,"Astra, Edition,","GS Line, Elegance,","Ultimate"]
["Opel","Insignia","1.5 CDTI",null,null,32699,null,null,4.5999999999999996,"Diesel",121,null,"6d-TEMP",5,90,null,122,null,"M6","4 897","2 093","1 455","1 503","2.0 CDTI","(4.7,122,128,174)",null,null,"Edition, Business","Elegance",null,null,"Style, Xcellence,","Reference"]
["Peugeot",208,"PureTech 75","S&S",null,15990,null,null,5.4,"Benzin",123,null,"6d",5,55,null,75,null,"M5",4055,1960,1430,1055,"PureTech 100","(5.4,123,74,101)","PureTech 130","(5.6,127,96,131)",null,null,"Like, Active, Allure",null,"Style, Xcellence",null,null,"Auch als Kombi","erhältlich "]
["Peugeot","308 SW","PureTech 130","Start&Stop",null,23600,null,null,5.9,"Benzin",134,null,"6d",5,81,null,110,null,"M6",4585,2043,1472,1205,"PureTech 130","(5.8, 130, 96, 131)",null,null,null,null,"Active, Style,"]
["Peugeot",508,"PureTech 180",null,null,42250,null,null,6.5,"Benzin",145,null,"6d",5,133,null,181,null,"A8",4750,2079,1403,1420,null,null,null,null,null,null,"Allure, GT Line","Xcellence"]
["Peugeot",3008,"PureTech 130",null,null,26790,null,null,6.3,"Benzin",144,null,"6d",5,96,null,131,null,"M6",4447,2098,1624,1320,null,null,null,null,"Allure, Active,","Access, GT Line"]
["Peugeot",5008,"PureTech 130",null,null,28790,null,null,6.5,"Benzin",147,null,"6d",5,96,null,131,null,"M6",4641,2098,1646,1410,null,null,null,null,"Allure, Active,","Access, GT Line"]
["Peugeot",208,"BlueHDi 100","Start&Stop",null,19530,null,null,4.0999999999999996,"Benzin",108,null,"6d-TEMP",5,75,null,102,null,"M6",4055,1960,1430,1165,null,null,null,null,"Like, Active,","Allure, GT Line"]
["Peugeot",308,"BlueHDi 100",null,null,23850,null,null,4.5,"Benzin",118,null,"6d-TEMP",5,75,null,102,null,"M6",4253,2043,1457,1205,"1.5 BlueHDi 130","(4.5,119,96,131)",null,null,"Active, Allure, Access,","GT-Line, Style",null,"Style, Monte Carlo",null,"Auch als Combi","erhältlich "]
["Peugeot",508,"BlueHDi 130",null,null,36750,null,null,4.7,"Benzin",120,null,"6d-TEMP",5,96,null,130,null,"M6",4750,2079,1403,1415,"BlueHDI 160","(5.5,144,120,163),","BlueHDI 180","(5.7,150,130,177)","Active, Allure,","GT Line, GT",null,null,"Active, Amibition,","Style, Monte Carlo"]
["Peugeot","308 SW","BlueHDi 130",null,null,27800,null,null,4.7,"Benzin",122,null,"6d-TEMP",5,96,null,130,null,"M6",4585,2043,1472,1205,null,null,null,null,"Active, Allure,","GT Line, Access,","Style",null,"Sport",null,null,"Auch als Rapid","Spaceback erhältlich "]
["Peugeot",2008,"BlueHDi 100",null,null,25510,null,null,4.5,"Benzin",118,null,"6d-TEMP",5,75,null,100,null,"M6",4300,1987,1530,1205,"BlueHDi 130","(4.9,129,96,130)",null,null,"Allure, Active,","GT-Line","Länge entspricht","shine"]
["Peugeot",3008,"BlueHDi 130",null,null,33000,null,null,5.2,"Benzin",136,null,"6d-TEMP",5,96,null,130,null,"M6",4447,2098,1624,1417,"BlueHDI 180","(6.1,162,130,180)",null,null,"Allure, GT Line,","Active, Crossway"]
["Peugeot",5008,"BlueHDi 130",null,null,34900,null,null,5.3,"Benzin",137,null,"6d-TEMP",5,96,null,130,null,"M6",4641,2098,1646,1430,null,null,null,null,"Allure, GT Line,","Active, Crossway"]
["Peugeot",208,"BlueHDi 100","Start&Stop",null,19530,null,null,4.0999999999999996,"Diesel",108,null,"6d-TEMP",5,75,null,102,null,"M6","4 055","1 960","1 430","1 165",null,null,null,null,"Like, Active,","Allure, GT Line"]
["Peugeot",308,"BlueHDi 100",null,null,23850,null,null,4.5,"Diesel",118,null,"6d-TEMP",5,75,null,102,null,"M6","4 253","2 043","1 457","1 205","1.5 BlueHDi 130","(4.5,119,96,131)",null,null,"Active, Allure, Access,","GT-Line, Style",null,"Kompakt-Van"]
["Peugeot",508,"BlueHDi 130",null,null,36750,null,null,4.7,"Diesel",120,null,"6d-TEMP",5,96,null,130,null,"M6","4 750","2 079","1 403","1 415","BlueHDI 160","(5.5,144,120,163),","BlueHDI 180","(5.7,150,130,177)","Active, Allure,","GT Line, GT",null,"Kompakt-Van"]
["Peugeot","308 SW","BlueHDi 130",null,null,27800,null,null,4.7,"Diesel",122,null,"6d-TEMP",5,96,null,130,null,"M6","4 585","2 043","1 472","1 205",null,null,null,null,"Active, Allure,","GT Line, Access,","Style","x-cite, x-clusiv,","x-style"]
["Peugeot",2008,"BlueHDi 100",null,null,25510,null,null,4.5,"Diesel",118,null,"6d-TEMP",5,75,null,100,null,"M6","4 300","1 987","1 530","1 205","BlueHDi 130","(4.9,129,96,130)",null,null,"Allure, Active,","GT-Line","Länge entspricht"]
["Peugeot ",108,"1.0 VTi 72",null,null,12740,null,null,4.8,"Benzin",109,null,"6d-TEMP",4,53,null,72,null,"M5",3475,1884,1460,915,null,null,null,"Active,","Allure, Collection",null,"Als 3-Türer oder",null,"Young, Active,","Style"]
["Renault","Twingo","SCe 75",null,null,9990,null,null,5.3,"Benzin",119,null,"6d-TEMP-EVAP",4,54,null,74,null,"M5",3615,1646,1541,981,"TCe 95","(5.3,119,68,93)",null,"Life, Intens, Zen",null,null,null,"Highline, Trendline,","Sky"]
["Renault","Clio","SCe 75",null,null,12940,null,null,5.4,"Benzin",120,null,"6d-TEMP-EVAP",5,53,null,72,null,"M5",4050,1988,1440,1148,"TCe 100","(5.1,116,74,100)","TCe 130","(5.7,130,96,130)",null,null,"Life, Zen, Intens,",null,"Comfortline,","Highline"]
["Renault","Megane Grandtour","TCe 115",null,null,19290,null,null,5.9,"Benzin",135,null,"6d-TEMP-EVAP",5,84,null,115,null,"M6",4626,2058,1457,1231,"TCe 140","(6.0,136,103,140)","TCe 160","(6.2,140,117,159)",null,null,"Intens, Life, Bose",null,"Highline, Trendline,","Comfortline, Rabbit"]
["Renault","Captur","TCe 100",null,null,18540,null,null,5.9,"Benzin",134,null,"6d-TEMP",5,74,null,100,null,"M5",4227,2003,1576,1248,"TCe 130","(6.3,141,96,130)",null,null,"Life, Zen, Intens,","Edition One, Initiale",null,null,"Highline, Trendline,","Comfortline, Rabbit"]
["Renault","Kadjar","TCe 140",null,null,22890,null,null,6.5,"Benzin",146,null,"6d-TEMP-EVAP",5,103,null,140,null,"M6",4489,2058,1607,1442,"TCe 160","(6.6,150,117,160)",null,null,"Life, Zen, Intens,","Black Edition",null,null,"Highline,","Comfortline"]
["Renault","Scenic","TCe 115",null,null,21390,null,null,6.6,"Benzin",149,null,"6d-TEMP",5,85,null,115,null,"M6",4406,2128,1653,1528,"TCe 140","(6.8,153,103,140)","TCe 160","(6.9,155,117,160)","Zen, Intens, Limited,","Bose, Initiale"]
["Renault","Clio","Blue dCi 85",null,null,18790,null,null,4.2,"Benzin",109,null,"6d-TEMP",5,63,null,85,null,"M6",4050,1988,1440,1277,"Blue dCi 115","(4.2,110,85,115)",null,null,"Life, Zen, Intens,","RS Line"]
["Renault","Megane","Blue dCi 115",null,null,24090,null,null,4.5,"Benzin",117,null,"6d-TEMP",5,85,null,115,null,"M6",4359,2058,1447,1315,null,null,null,null,"Life, Zen, Intens,","Edition One, RS Line",null,"Highline, Sky",null,"Auch als 7-Sitzer","erhältlich"]
["Renault","Megane Grandtour","Blue dCi 115",null,null,25090,null,null,4.5,"Benzin",118,null,"6d-TEMP",5,85,null,116,null,"M6",4626,2058,1449,1315,null,null,null,null,"Limited, Intens,","Bose, GT-Line"]
["Renault","Captur","Blue dCi 115",null,null,24890,null,null,4.7,"Benzin",123,null,"6d-TEMP",5,85,null,115,null,"M6",4227,2003,1576,1490,null,null,null,null,"Life, Zen,","Intens, Edition One","Länge entspricht"]
["Renault","Kadjar","Blue dCi 115",null,null,27090,null,null,5,"Benzin",131,null,"6d-TEMP",5,85,null,115,null,"M6",4489,2058,1613,1531,"Blue dCi 150","(5.5,145,110,150)",null,null,"Zen, Intens,","Black Edition"]
["Renault","Clio","Blue dCi 85",null,null,18790,null,null,4.2,"Diesel",109,null,"6d-TEMP",5,63,null,85,null,"M6","4 050","1 988","1 440","1 277","Blue dCi 115","(4.2,110,85,115)",null,null,"Life, Zen, Intens,","RS Line",null,"Variant erhältlich"]
["Renault","Megane","Blue dCi 115",null,null,24090,null,null,4.5,"Diesel",117,null,"6d-TEMP",5,85,null,115,null,"M6","4 359","2 058","1 447","1 315",null,null,null,null,"Life, Zen, Intens,","Edition One, RS Line"]
["Renault","Megane Grandtour","Blue dCi 115",null,null,25090,null,null,4.5,"Diesel",118,null,"6d-TEMP",5,85,null,116,null,"M6","4 626","2 058","1 449","1 315",null,null,null,null,"Limited, Intens,","Bose, GT-Line"]
["Renault","Captur","Blue dCi 115",null,null,24890,null,null,4.7,"Diesel",123,null,"6d-TEMP",5,85,null,115,null,"M6","4 227","2 003","1 576","1 490",null,null,null,null,"Life, Zen,","Intens, Edition One","Länge entspricht","erhältlich"]
["Seat","Ibiza","1.0l",null,null,12990,null,null,5.4,"Benzin",122,null,"6d-TEMP",5,59,null,80,null,"M5",4059,1942,1444,1099,"1.0 ECO TSI","(5.5,123,70,95)","1.0 ECO TSI","(5.4,122,85,115)","1.0 (4.9,112,59,80)",null,"Fast Lane, Style,","erhältlich"]
["Seat","Leon","1.0 TSI",null,null,19990,null,null,5.4,"Benzin",122,null,"6d-TEMP",5,81,null,110,null,"M6",4282,1816,1459,1202,null,null,null,null,null,null,"Style, FR"]
["Seat","Arona","1.0 Eco TSI",null,null,16690,null,null,5.6,"Benzin",128,null,"6d-TEMP",5,70,null,95,null,"M5",4138,1780,1552,1180,"1.0 Eco TSI","(5.8,131,85,115)",null,null,"Style, Xcellence,","Reference, FR"]
["Seat","Ateca","1.0 Eco TSI",null,null,16690,null,null,6.5,"Benzin",146,null,"6d-TEMP",5,85,null,116,null,"M6",4363,2078,1601,1313,"1.4 TSI","(6.4,145,110,150)",null,null,"Reference, Style,","Xcellence"]
["Seat","Alhambra","1.4 TSI",null,null,40130,null,null,6.5,"Benzin",150,null,"6d-TEMP",5,110,null,150,null,"M6",4854,2081,1720,1695,null,null,null,null,"Executive,","Xcellence, FR",null,"Auch als Combi","erhältlich ","Auch als Limousine","erhältlich"]
["Seat","Arona","1.6 TDI",null,null,19990,null,null,4.8,"Benzin",125,null,"6d-TEMP",5,70,null,95,null,"M5",4138,1942,1543,1297,null,null,null,null,"Reference, Style,","Xcellence",null,"Limousine erhältlich "]
["Seat","Ateca","1.6 TDI",null,null,25880,null,null,5,"Benzin",139,null,"6d-TEMP",5,85,null,116,null,"M6",4363,2078,1601,1428,"2.0 TDI","(5.4,142,110,150)",null,null,"Reference, Style,","Xcellence",null,null,null,"4/5 Türer,","Sportstourer"]
["Seat","Arona","1.6 TDI",null,null,19990,null,null,4.8,"Diesel",125,null,"6d-TEMP",5,70,null,95,null,"M5","4 138","1 942","1 543","1 297",null,null,null,null,"Reference, Style,","Xcellence",null,"auch als Combi","erhältlich"]
["Skoda","Fabia","1.0 TSI",null,null,13240,null,null,5.4,"Benzin",123,null,"6d-TEMP-EVAP-ISC",5,70,null,95,null,"M5",3997,1958,1467,1116,"1.0 MPI","(5.8,132,44,60)",null,"Active, Ambition,","Style, Monte Carlo",null,"Auch als Combi","auch als Combi","erhältlich"]
["Skoda","Fabia Combi","1.0 TSI",null,null,13590,null,null,5.3,"Benzin",119,null,"6d-TEMP-EVAP-ISC",5,70,null,95,null,"M5",4262,1958,1488,1136,null,null,null,null,null,null,"Active, Amibition,"]
["Skoda","Scala","1.0 TSI",null,null,18980,null,null,5.5,"Benzin",126,null,"6d-TEMP-EVAP-ISC",5,70,null,95,null,"M5",4362,1988,1471,1192,"1.0 TSI","(5.5,124,85,115)","1.5 TSI","(5.7,130,110,150)",null,null,"Active, Amibition,","Spaceback erhältlich"]
["Skoda","Octavia Combi","1.0 TSI",null,null,26880,null,null,5.3,"Benzin",120,null,"6d-TEMP-EVAP-ISC",5,84,null,115,null,"M6",4689,1994,1468,1285,"1.5 TSI","(5.7, 129, 110, 150)",null,null,null,null,"Business, Premium"]
["Skoda","Superb","1.5 TSI",null,null,33840,null,null,6.2,"Benzin",141,null,"6d-TEMP-EVAP-ISC",5,110,null,150,null,"M6",4861,1864,1458,1435,null,null,null,null,null,null,"Active, Ambition,"]
["Skoda","Karoq","1.0 TSI",null,null,23980,null,null,6.3,"Benzin",142,null,"6d-TEMP-EVAP-ISC",5,85,null,116,null,"M6",4382,2025,1603,1344,"1.5 TSI","(6.3,144,110,150)",null,null,"City, Amibition,","Style"]
["Skoda","Octavia Combi","2.0 l TDI",null,null,29970,null,null,4.4000000000000004,"Benzin",117,null,"6d-TEMP-EVAP-ISC",5,85,null,116,null,"M6",4689,1994,1468,1370,"2.0 TDI","(4.6,122,110,150)",null,null,"Business, Premium",null,null,"Höhe entspricht","Microvan-Kriterien"]
["Skoda","Kamiq","1.6l TDI ",null,null,24050,null,null,5,"Benzin",131,null,"6d-TEMP-EVAP-ISC",5,85,null,115,null,"M6",4241,1988,1553,1336,null,null,null,null,"Active, Ambition","Style, Monte Carlo"]
["Skoda","Octavia Combi","2.0 l TDI",null,null,29970,null,null,4.4000000000000004,"Diesel",117,null,"6d-TEMP-EVAP-ISC",5,85,null,116,null,"M6","4 689","1 994","1 468","1 370","2.0 TDI","(4.6,122,110,150)",null,null,"Business, Premium"]
["Skoda","Kamiq","1.6l TDI",null,null,24050,null,null,5,"Diesel",131,null,"6d-TEMP-EVAP-ISC",5,85,null,115,null,"M6","4 241","1 988","1 553","1 336",null,null,null,null,"Active, Ambition","Style, Monte Carlo"]
["Suzuki","Swift","1.2 Dualjet",null,null,13490,null,null,5.0999999999999996,"Benzin",115,null,"6d-TEMP-EVAP",5,66,null,90,null,"M5",3840,1735,1480,857,null,null,null,"Clear, Shine",null,null,null,"Als 3-Türer oder","5-Türer erhältlich"]
["Suzuki","Ignis","1.2 Dualjet AGS",null,null,16390,null,null,5.6,"Benzin",126,null,"6d-TEMP-EVAP",4,66,null,90,null,"A5",3700,1660,1595,860,null,null,null,null,"Clear, Shine"]
["Suzuki","Vitara","1.4 DITC",null,null,26490,null,null,7.4,"Benzin",167,null,"6d-TEMP",5,103,null,140,null,"M6",4170,1775,1595,1205,null,null,null,null,"clear, shine",null,null,"Als 3-Türer oder","5-Türer erhältlich"]
["Toyota","Aygo","1.0 VVT-i",null,null,11490,null,null,5,"Benzin",112,null,"6d-TEMP-EVAP-ISC",4,53,null,72,null,"M5",3465,1615,1460,840,null,null,null,"x, x-play,","x-cite, x-clusiv,","x-style"]
["Toyota","Yaris","1.0 VVT-i",null,null,13190,null,null,5.8,"Benzin",131,null,"6d-TEMP-EVAP-ISC",5,53,null,72,null,"M5",3945,1695,1510,980,"1.5 VVT-i","(6.0,135,82,111)",null,"Young, Active,","Lounge"]
["Toyota","Corolla Kombi","1.2 Turbo",null,null,22290,null,null,6.2,"Benzin",140,null,"6d-TEMP",5,85,null,116,null,"M6",4650,1790,1435,1205,null,null,null,null,null,null,"Young, Active, Style"]
["VW","up!","1.0l",null,null,12680,null,null,5.4,"Benzin",123,null,"6d-TEMP-EVAP-ISC",5,44,null,60,null,"M5",3600,1910,1504,980,"1.0l","(5.3,120,85,115)",null,"black style,","white style,","R-Line, GTI"]
["VW","Polo","1.0 TSI",null,null,15110,null,null,5.3,"Benzin",120,null,"6d-TEMP-EVAP-ISC",5,85,null,115,null,"M6",4053,1964,1461,1120,"1.0 (5.4,123,44,60)",null,null,null,null,null,"Comfortline,"]
["VW","Golf","1.5 TSI ACT",null,null,26990,null,null,5.4,"Benzin",122,null,"6d-TEMP-EVAP-ISC",5,96,null,130,null,"M6",4284,1789,1491,1315,null,null,null,null,null,null,"Life"]
["VW","Golf Variant","1.0 TSI",null,null,25570,null,null,5.6,"Benzin",126,null,"6d-TEMP-EVAP-ISC",5,85,null,116,null,"M6",4567,2027,1515,1300,"1.5 TSI","(5.6,128, 96, 131)","1.5 TSI","(5.7, 130, 110, 150)",null,null,"Rabbit, Comfortline","auch als Passat","Variant erhältlich"]
["VW","Passat","1.5 TSI ACT",null,null,32590,null,null,5.8,"Benzin",133,null,"6d-TEMP-EVAP-ISC",5,110,null,150,null,"M6",4775,2083,1483,1425,"2.0 TSI","(7.6,171,140,190)",null,null,null,null,"Business, Elegance"]
["VW","T-Cross","1.0 TSI",null,null,19790,null,null,5.9,"Benzin",133,null,"6d-TEMP-EVAP-ISC",5,70,null,95,null,"M5",4108,1977,1584,1245,"1.0 TSI","(6.0,137,85,115)",null,null,"Life, Style"]
["VW","Golf Sportsvan","1.0 TSI ",null,null,27420,null,null,5.9,"Benzin",133,null,"6d-TEMP-EVAP-ISC",5,85,null,116,null,"M6",4351,2050,1613,1330,"1.5 TSI","(5.7,1130,96,131)","1.5 TSI","(6.5,147,110,150)","Highline, Comfortline"]
["VW","Golf","2.0 TDI",null,null,29390,null,null,4.0999999999999996,"Benzin",107,null,"6d-TEMP-EVAP-ISC",5,85,null,115,null,"M6",4284,1789,1491,1380,null,null,null,null,"Rabbit, Life, Style",null,null,null,null,null,null,"Ocean Race"]
["VW","Passat Limousine","2.0 TDI",null,null,36659,null,null,4.7,"Benzin",122,null,"6d-TEMP-EVAP-ISC",5,110,null,150,null,"M6",4775,2083,1483,1525,"1.6 TDI","(5.4,141,88,120)",null,null,"Business, Elegance"]
["VW","T-Roc","1,6 TDI",null,null,25770,null,null,5.2,"Benzin",136,null,"6d-TEMP-EVAP-ISC",5,85,null,115,null,"M6",4234,1992,1573,1395,"2,0 TDI","(5.4,141,110,150)",null,null,"T-Roc, Design, Sport"]
["VW","Golf Sportsvan","1.6 TDI",null,null,30120,null,null,5.2,"Benzin",136,null,"6d-TEMP-EVAP-ISC",5,85,null,116,null,"M5",4351,2050,1613,1440,"2.0 TDI","(5.4,142,110,150)",null,null,"Comfortline,","Highline"]
["VW","Golf","2.0 TDI",null,null,29390,null,null,4.0999999999999996,"Diesel",107,null,"6d-TEMP-EVAP-ISC",5,85,null,115,null,"M6","4 284","1 789","1 491","1 380",null,null,null,null,"Rabbit, Life, Style"]
["VW","Passat Limousine","2.0 TDI",null,null,36659,null,null,4.7,"Diesel",122,null,"6d-TEMP-EVAP-ISC",5,110,null,150,null,"M6","4 775","2 083","1 483","1 525","1.6 TDI","(5.4,141,88,120)",null,null,"Business, Elegance"]
["VW","T-Roc","1,6 TDI",null,null,25770,null,null,5.2,"Diesel",136,null,"6d-TEMP-EVAP-ISC",5,85,null,115,null,"M6","4 234","1 992","1 573","1 395","2,0 TDI","(5.4,141,110,150)",null,null,"T-Roc, Design, Sport"]