{"text_format":"1","workbook":"xlsx","n_sheets":14,"sheets":["Aktualisierungen","Erläuterungen","Eingabe","Daten-Elektrofahrzeug","Daten-Benzin-Dieselfahrzeug","Berechnungen","Förderungen","Wetterdaten","PLZ-Zuordnung","Strompreis","Motorbez. Versicherungssteuer","Enamo-Tarif","topprodukte-elektro","topprodukte-benzin-diesel"],"not_rendered":{"charts":9,"images":28,"macros":1,"external_links":0,"defined_names":41,"comments":0,"pivot_tables":0},"unopened":[],"bounds":{"document_bytes":16777216,"sheet_cells":100000,"rows_first":2000,"rows_last":500,"rows_between":2000,"halvings":0,"cell_chars":16384,"cell_head_chars":4096},"cells_cut":0,"cells_raw":0,"read":"whole","date_system":"1900"}

{"sheet":"Aktualisierungen","index":0,"n_rows":0,"n_cols":0,"rows_kept":0,"cut":false,"hidden":true,"merged":[[4,0,4,8],[5,0,5,8]]}

{"sheet":"Erläuterungen","index":1,"n_rows":0,"n_cols":0,"rows_kept":0,"cut":false,"hidden":true,"merged":[[4,0,4,8],[5,0,5,8],[21,1,21,4],[22,1,22,7]]}

{"sheet":"Eingabe","index":2,"n_rows":149,"n_cols":43,"rows_kept":149,"cut":false,"hidden":false,"merged":[[102,3,102,27],[96,3,96,27],[35,2,35,3],[94,6,94,10],[95,6,95,10],[94,3,94,5],[95,3,95,5],[93,3,93,27],[79,5,79,10],[79,11,79,14],[35,35,35,36],[25,15,25,18],[25,5,25,10],[25,11,25,14],[71,11,71,14],[71,5,71,10],[35,31,35,32],[35,33,35,34],[55,5,55,10],[55,11,55,14],[55,15,55,18],[38,15,38,18],[38,5,38,10],[38,11,38,14],[1,1,1,16],[15,15,15,18],[19,15,19,18],[0,2,0,8],[9,5,9,10],[9,11,9,14],[15,12,15,13],[11,12,12,13],[11,6,11,9],[7,6,7,9],[15,6,15,9],[16,6,16,7],[5,21,12,27],[22,6,22,7],[81,12,81,17],[84,12,84,17],[17,6,17,7],[18,6,18,7],[19,6,19,7],[20,6,20,7],[21,6,21,7],[11,16,11,18],[12,6,12,7]]}
[null,null,null,null,null,null,null,null,null,null,null,null,null,null,null,null,null,null,null,null,null,null,null,null,null,null,null,null,null,null,null,null,null,null,null,null,"Jahreseinkommen",25000,{"$f":"M29*0.015","v":730.35},{"$f":"20.68/100*AM1","v":151.03637999999998},{"$f":"AM1*AQ9/100","v":255.6225},{"$f":"SUM(AN1:AO1)","v":406.65887999999995}]
[null,"E-Mobilitätsrechner\nE_MOB_Rechner_0325_Vers.7.2",null,null,null,null,null,null,null,null,null,null,null,null,null,null,null,null,null,null,null,null,null,null,null,null,null,null,null,null,null,null,null,null,null,null,null,"Jahr der Anschaffung","CO2 Grenzwert",null,"Einkommen","Einkommenssteuer"]
[null,null,null,null,null,null,null,null,null,null,null,null,null,null,null,null,null,null,null,null,null,null,null,null,null,null,null,null,null,null,null,null,null,null,null,null,null,2016,130,null,11000,0]
[null,null,"1. Fahrzeugauswahl",null,null,null,null,null,null,null,null,null,null,null,null,null,null,null,null,null,null,"7. Ausfüllhilfe",null,null,null,null,null,null,null,null,null,null,null,null,null,null,null,2017,127,null,18000,25]
[null,null,null,null,null,null,null,null,null,null,null,null,null,null,null,null,null,null,null,null,null,null,null,null,null,null,null,null,null,null,null,null,null,null,null,null,null,2018,124,null,31000,35]
[null,null,"Allgemeine Angaben",null,null,null,null,null,null,null,null,null,null,null,null,null,null,null,null,null,null,"Alle weißen Felder sind veränderbar und mit überschreibbaren Defaultwerten befüllt.\nTragen Sie in der ersten Kategorie \"Fahrzeugwahl\" die allgemeinen Eingaben ein und wählen Sie ein Fahrzeug, das Sie vergleichen wollen, aus. Scrollen Sie nach unten und kontrollieren Sie die Defaultwerte aus den Kategorien 2-5. Passen Sie diese Ihren individuellen Gegebenheiten an und entnehmen Sie aus den Grafiken die Ergebnisse.\n \nViel Erfolg wünscht Ihr strommobil-Team",null,null,null,null,null,null,null,null,null,null,null,null,null,null,null,2019,121,null,60000,42]
[null,null,null,"Jahreskilometerleistung:",null,null,4000,"[km/a]",null,null,null,null,null,"Betrachtungszeitraum1:",null,null,12,"[a]",null,null,null,null,null,null,null,null,null,null,null,null,null,null,null,null,null,null,null,2020,118,null,90000,48]
[null,null,null,{"$f":"IF(G8=\"privat\",\"Nutzung (Privater Investor):\",IF(G8=\"betrieblich\",\"Nutzung (Betrieb ist Investor):\",IF(G8=\"betrieblich + privat (<6000km/a):\",\"Nutzung (Betrieb ist Investor):\",\"Nutzung (Betrieb ist Investor):\")))","v":"Nutzung (Privater Investor):"},null,null,"privat",null,null,null,null,null,null,null,null,null,null,null,null,null,null,null,null,null,null,null,null,null,null,null,"Laufzeit",{"$f":"Q7","v":12},null,null,null,null,null,null,null,null,1000000,50]
{"$rows_left_out":142}
{"sheet":"Daten-Elektrofahrzeug","index":3,"n_rows":77,"n_cols":49,"rows_kept":77,"cut":false,"hidden":false,"merged":[[0,0,0,2],[2,6,2,7],[2,9,2,10],[2,11,2,12],[1,6,1,7],[1,0,1,2]]}
["Allgemeine Daten Elektrofahrzeuge",null,null,null,null,null,null,null,null,null,null,null,null,null,null,null,null,null,null,null,null,null,null,null,null,null,null,null,null,null,null,null,"Batteriemiete und Berechnung \"Nissan Leaf\"",null,null,null,null,null,null,null,null,"Batteriemiete und Berechnung \"Renault Zoe R90 - Standard\""]
["https://www.topprodukte.at",null,null,null,null,null,"Stromverbrauch",null,"CO2-Emissionen",null,null,null,null,null,null,null,null,null,null,null,null,null,null,null,null,null,null,null,null,null,{"$f":"VLOOKUP(AF2,AG2:AL5,IF(#REF!+1<=1,6,#REF!+1),TRUE)","v":{"$error":"#REF!"}},{"$f":"IF(Eingabe!G14<='Daten-Elektrofahrzeug'!AG3,'Daten-Elektrofahrzeug'!AG3,IF(Eingabe!G14<='Daten-Elektrofahrzeug'!AG4,'Daten-Elektrofahrzeug'!AG4,'Daten-Elektrofahrzeug'!AG5))","v":36},"Vertragslaufzeit",12500,15000,17500,20000,25000,null,{"$f":"VLOOKUP(AO2,AP2:AW5,IF(#REF!+1<=1,8,#REF!+1),TRUE)","v":{"$error":"#REF!"}},{"$f":"IF(Eingabe!$G$14<='Daten-Elektrofahrzeug'!AP3,'Daten-Elektrofahrzeug'!AP3,IF(Eingabe!$G$14<='Daten-Elektrofahrzeug'!AP4,'Daten-Elektrofahrzeug'!AP4,'Daten-Elektrofahrzeug'!AP5))","v":36},"Vertragslaufzeit",7500,10000,12500,15000,17500,20000,20200]
["Marke","Modell","Modellauswahl","Typ","Leistung (max.)","Kraftstoff","kombiniert",null,"kombiniert","Preis bei Batteriemiete",null,"Preis bei Batteriekauf",null,"Anmerkung Garantie",null,"Leistung (dauer)","Leergewicht",null,null,null,null,null,null,null,null,null,null,null,null,null,null,null,12,99,106,114,122,142,null,null,null,12,59,69,79,89,99,109,{"$f":"IF(Eingabe!$G$8=\"privat\",119,109)","v":119}]
[null,null,null,null,"[kW]",4,"kWh/100km","l/100km","[g/km]","[€]","[€/Monat]","[€]","[€/Monat]","(Abweichungen vorbehalten)",null,"[kW]","[kg]",null,null,null,null,null,null,null,null,null,null,null,null,null,null,null,24,89,96,104,112,132,null,null,null,24,59,69,79,89,99,109,{"$f":"IF(Eingabe!$G$8=\"privat\",119,109)","v":119}]
[null,null,1,2,3,4,5,6,7,8,9,10,11,12,null,14,15,null,null,null,null,null,null,null,null,null,null,null,null,null,null,null,36,79,86,94,102,122,null,null,null,36,59,69,79,89,99,109,{"$f":"IF(Eingabe!$G$8=\"privat\",119,109)","v":119}]
["eigenes","Fahrzeug",{"$f":"CONCATENATE(A6,\" \",B6)","v":"eigenes Fahrzeug"},"EV",null,"Elektrizität",null,null,0]
["eigenes","Fahrzeug",{"$f":"CONCATENATE(A7,\" \",B7)","v":"eigenes Fahrzeug"},"EV",null,"Elektrizität",null,null,0]
["eigenes","Fahrzeug","eigenes Fahrzeug","EV",null,"Elektrizität",null,null,0]
{"$rows_left_out":70}
{"sheet":"Daten-Benzin-Dieselfahrzeug","index":4,"n_rows":462,"n_cols":35,"rows_kept":462,"cut":false,"hidden":false,"merged":[[2,18,2,19],[3,18,3,19],[2,5,2,6],[1,5,1,6],[0,0,0,2],[1,0,1,2],[2,13,3,13]]}
["Allgemeine Daten Verbrennungskraftfahrzeuge"]
["https://www.topprodukte.at",null,null,null,null,"Kraftstoffverbrauch",null,"CO2-Emissionen"]
["Marke","Modell","Modellauswahl","Leistung","Kraftstoff","kombiniert",null,"kombiniert","Preis","Sachbezug","Lohnnebenkosten","Quelle",null,"* Energieinhalt:",{"$f":"O8*0.72/3600","v":8.5399999999999991},"kWh/liter Benzin",null,null,"Anschaffungsjahr:",null,2025,null,null,"Jahr der Anschaffung","CO2 Grenzwert"]
[null,null,null,"[kW]",null,"kWh/100km*","l/100km","[g/km]","[€]","[€/m]","[€/m]",null,null,null,{"$f":"O9*0.87/3600","v":10.1065},"kWh/liter Diesel",null,null,"CO2 Grenzwert:",null,{"$f":"VLOOKUP(U3,X5:Y12,2,TRUE)","v":126},"[g/km]",null,"[a]","[g/km]"]
[null,null,1,2,3,4,5,6,7,8,9,null,null,null,null,null,null,null,null,null,null,null,null,2016,130,"(NEFZ-Wert)"]
["Eingabe","eigenes Fahrzeug",{"$f":"CONCATENATE(A6,\" \",B6,\" - \",E6)","v":"Eingabe eigenes Fahrzeug - "},null,null,null,null,null,null,{"$f":"IF(H6>$U$4,IF(I6*0.02>960,960,I6*0.02),IF(H6>0,IF(I6*0.015>720,720,I6*0.015),0))","v":0},{"$f":"J6*Eingabe!$C$52","v":0},null,null,null,null,null,null,null,null,null,null,null,null,2017,127,"(NEFZ-Wert)"]
["Eingabe","eigenes Fahrzeug",{"$f":"CONCATENATE(A7,\" \",B7,\" - \",E7)","v":"Eingabe eigenes Fahrzeug - "},null,null,null,null,null,null,{"$f":"IF(H7>$U$4,IF(I7*0.02>960,960,I7*0.02),IF(H7>0,IF(I7*0.015>720,720,I7*0.015),0))","v":0},{"$f":"J7*Eingabe!$C$52","v":0},null,null,null,null,null,null,null,null,null,null,null,null,2018,124,"(NEFZ-Wert)"]
["Eingabe","eigenes Fahrzeug","Eingabe eigenes Fahrzeug - ",null,null,null,null,null,null,{"$f":"IF(H8>$U$4,IF(I8*0.02>960,960,I8*0.02),IF(H8>0,IF(I8*0.015>720,720,I8*0.015),0))","v":0},{"$f":"J8*Eingabe!$C$52","v":0},null,null,"Hu Benzin(Mittelwert) =",42700,"kJ/kg",null,"Benzin",null,null,null,null,null,2019,121,"(NEFZ-Wert)"]
{"$rows_left_out":455}
{"sheet":"Berechnungen","index":5,"n_rows":56,"n_cols":22,"rows_kept":56,"cut":false,"hidden":false,"merged":[[24,1,24,6]]}
[null,null,null,null,null,null,null,null,null,null,null,null,null,null,"Motorbezogene Versicherungssteuer für E-Autos ab 01. April 2025 (in Österreich)"]
[]
[null,"Jahre","Einnahmen","Ausgaben","Cash Flow","Barwerte","Kapitalwert","Zeit",null,null,null,null,null,null,"Gewähltes Modell","Leistung (max.)","Leistung (Dauer)","Leergewicht","Motorsteuer","Massensteuer","Gesamtsteuer","Steuer pro Jahr"]
[null,null,"[€]","[€]","[€]","[€]","[€]",null,null,null,null,null,null,null,null,"kW","kW","kg","EUR","EUR","EUR","EUR"]
[null,0,null,{"$f":"Eingabe!Q33*-1","v":1610},{"$f":"C5-D5","v":-1610},{"$f":"E5/(1+(Eingabe!G$77/100))^B5","v":-1610},{"$f":"F5","v":-1610},{"$f":"IF(G5<0,I5,0)","v":1},1,null,null,null,null,null,{"$f":"Eingabe!G12","v":"Cupra  Born"},{"$f":"VLOOKUP($O$5, 'Daten-Elektrofahrzeug'!$C$6:$Q$79, 'Daten-Elektrofahrzeug'!E5, FALSE)","v":150},{"$f":"IF(ISBLANK(Eingabe!I42), VLOOKUP($O$5, 'Daten-Elektrofahrzeug'!$C$6:$Q$79, 'Daten-Elektrofahrzeug'!P5, FALSE), Eingabe!I42)","v":115},{"$f":"IF(ISBLANK(Eingabe!I43), VLOOKUP($O$5,'Daten-Elektrofahrzeug'!$C$6:$Q$79,'Daten-Elektrofahrzeug'!Q5,FALSE), Eingabe!I43)","v":1840},{"$f":"IF((Dauerleistung-Freibetrag_kW)>(gw1_kW+gw2_kW), (Dauerleistung-Freibetrag_kW-(gw1_kW+gw2_kW))*Restwert_EURprokW+gw1_kW*gw1_EURprokW+gw2_kW*gw2_EURprokW, IF((Dauerleistung-Freibetrag_kW)>(gw1_kW), (Dauerleistung-Freibetrag_kW-gw1_kW)*gw2_EURprokW+gw1_kW*gw1_EURprokW, IF((Dauerleistung>Freibetrag_kW), Dauerleistung*gw1_EURprokW, 0)))","v":22},{"$f":"IF((Leergewicht-Freibetrag_kg)>(gw1_kg+gw2_kg), (Leergewicht-Freibetrag_kg-(gw1_kg+gw2_kg))*Restwert_EURprokg+gw1_kg*gw1_EURprokg+gw2_kg*gw2_EURprokg, IF((Leergewicht-Freibetrag_kg)>(gw1_kg), (Leergewicht-Freibetrag_kg-gw1_kg)*gw2_EURprokg+gw1_kg*gw1_EURprokg, IF((Leergewicht>Freibetrag_kg), Leergewicht*gw1_EURprokg, 0)))","v":20.7},{"$f":"S5+T5","v":42.7},{"$f":"U5*12","v":512.40000000000009}]
[null,1,{"$f":"E28+Eingabe!$Q$53","v":509.81252631578946},{"$f":"Eingabe!$G$68+IF(Eingabe!$G$34=B6,Eingabe!$G$35,0)","v":0},{"$f":"(C6-D6)/(1+(Eingabe!$G$74/100))^B6","v":500.30669903414082},{"$f":"E6/(1+(Eingabe!G$77/100))^B6","v":492.91300397452301},{"$f":"G5+F6","v":-1117.086996025477},{"$f":"IF(G6<0,I6,0)","v":2},2]
[null,2,{"$f":"E29+Eingabe!$Q$53","v":514.85979421052627},{"$f":"Eingabe!$G$68+IF(Eingabe!$G$34=B7,Eingabe!$G$35,0)","v":0},{"$f":"(C7-D7)/(1+(Eingabe!$G$74/100))^B7","v":495.83891749644522},{"$f":"E7/(1+(Eingabe!G$77/100))^B7","v":481.29187070440474},-635.79512532107219,{"$f":"IF(G7<0,I7,0)","v":3},3]
[null,3,{"$f":"E30+Eingabe!$Q$53","v":520.01998072368428},{"$f":"Eingabe!$G$68+IF(Eingabe!$G$34=B8,Eingabe!$G$35,0)","v":0},{"$f":"(C8-D8)/(1+(Eingabe!$G$74/100))^B8","v":491.4705271016914},{"$f":"E8/(1+(Eingabe!G$77/100))^B8","v":470.00161699020657},-165.79350833086562,4,4,null,null,null,null,null,"Tabellen Steuergrenzen und Kosten"]
{"$rows_left_out":49}
{"sheet":"Förderungen","index":6,"n_rows":112,"n_cols":20,"rows_kept":112,"cut":false,"hidden":true,"merged":[[53,2,53,3],[53,4,53,5],[53,6,53,7],[67,2,67,3],[67,4,67,5],[67,6,67,7],[103,2,103,3],[103,4,103,5],[103,6,103,7],[79,6,79,7],[57,10,57,15],[91,2,91,3],[91,4,91,5],[91,6,91,7],[79,2,79,3],[79,4,79,5],[71,10,71,15],[45,10,45,15],[29,6,29,7],[107,10,107,15],[83,10,83,15],[95,10,95,15],[74,10,74,15],[14,18,14,27],[41,6,41,7],[38,19,38,22],[4,18,4,27],[5,6,5,7],[33,10,33,15],[35,19,35,21],[5,2,5,3],[5,4,5,5],[21,10,21,15],[41,4,41,5],[41,2,41,3],[17,2,17,3],[17,4,17,5],[17,6,17,7],[29,2,29,3],[29,4,29,5],[9,10,9,15],[31,2,31,3],[32,2,32,3],[33,2,33,3],[34,2,34,3]]}
[]
[]
[null,"Gesamte Förderung:",null,null,null,null,null,null,null,"Landesförderungen:",null,null,null,null,null,null,null,null,"Bundesförderungen:"]
[]
[null,"Förderung für Burgenland",null,null,null,null,null,null,null,"Förderungen aktualisiert am 11.12.2013",null,null,null,null,null,null,null,null,"Klima- und Energiefonds Förderaktion Photovoltaik-Anlagen 2014"]
[null,null,"Anlagengröße",null,"Landesförderung",null,"Bundesförderung"]
[null,null,"","","Investition",null,"Investition","Tarif"]
[null,null,"1 - 3","kWp",300,"€/kWp",{"$f":"IF(H11<>0,200,IF(Eingabe!#REF!=Eingabe!C127,IF(Eingabe!#REF!=Eingabe!C179,275,IF(Eingabe!#REF!=Eingabe!C178,375,0)),0))","v":{"$error":"#REF!"}},"-"]
{"$rows_left_out":105}
{"sheet":"Wetterdaten","index":7,"n_rows":54,"n_cols":13,"rows_kept":54,"cut":false,"hidden":true,"merged":[]}
["Ort","PLZ","Land","PLZ-Differenz","Jährliche Einstrahlung","mittlere Aussentemperatur","Längengrad","Breitengrad","Ermittlung der Einstrahlung"]
[null,null,null,null,"[kWh/m²a]","[°C]","[°]","[°]"]
["Admont",8911,"AUT",{"$f":"IF(B3>$L$3,B3-$L$3,$L$3-B3)","v":{"$error":"#VALUE!"}},1028.32,"    5.86","-14.45"," 47.57",{"$f":"IF($L$4=D3,E3,0)","v":{"$error":"#VALUE!"}},{"$f":"IF(I3=0,0,1)","v":{"$error":"#VALUE!"}},"PLZ:",{"$f":"Eingabe!M12","v":"VW Touran R-Line TDI - Diesel"}]
["Amstetten",3300,"AUT",{"$error":"#VALUE!"},1069.0999999999999,"    8.79","-14.83"," 48.08",{"$error":"#VALUE!"},{"$f":"IF(I4=0,0,1)","v":{"$error":"#VALUE!"}},"Diff:",{"$f":"MIN(D3:D53)","v":{"$error":"#VALUE!"}}]
["Arriach",9543,"AUT",{"$error":"#VALUE!"},1144.54,"    6.46","-13.85"," 46.72",{"$error":"#VALUE!"},{"$error":"#VALUE!"},"Einstrahlung",{"$f":"ROUNDDOWN(K54,-0.5)","v":{"$error":"#VALUE!"}},"kWh/m²a"]
["Bad Gleichenberg",8344,"AUT",{"$error":"#VALUE!"},1153.19,"    9.14","-15.88"," 46.87",{"$error":"#VALUE!"},{"$error":"#VALUE!"}]
["Bad Ischl",4820,"AUT",{"$error":"#VALUE!"},1093.31,"    7.90","-13.60"," 47.72",{"$error":"#VALUE!"},{"$error":"#VALUE!"}]
["Bludenz",6700,"AUT",{"$error":"#VALUE!"},1079.79,"    7.97"," -9.82"," 48.50",{"$error":"#VALUE!"},{"$error":"#VALUE!"}]
{"$rows_left_out":47}
{"sheet":"PLZ-Zuordnung","index":8,"n_rows":2460,"n_cols":10,"rows_kept":2460,"cut":false,"hidden":true,"merged":[]}
["PLZ","Ort","Bundesland","NamePLZTyp","intern_extern","adressierbar","Postfach"]
[null,null,null,null,null,null,null,null,"Zuordnung der PLZ und des Ortes (Bundesland):"]
[1004,"Wien","W","InteressentenPLZ","extern","Nein","Ja",null,{"$f":"Eingabe!M12","v":"VW Touran R-Line TDI - Diesel"},{"$f":"VLOOKUP(I3,A3:C2460,3,TRUE)","v":{"$error":"#N/A"}}]
[1010,"Wien","W","PLZ-Adressierung","extern","Ja","Ja",null,null,{"$f":"VLOOKUP(J3,I7:J15,2,TRUE)","v":{"$error":"#N/A"}}]
[1011,"Wien Postfach","W","PLZ-Postfach","extern","Nein","Ja",null,null,{"$f":"VLOOKUP(I3,A3:C2460,2,FALSE)","v":{"$error":"#N/A"}}]
[1012,"Wien","W","PLZ-Postfach","extern","Nein","Ja"]
[1013,"Wien","W","PLZ-Postfach","extern","Nein","Ja",null,"B","Burgenland"]
[1014,"Wien","W","PLZ-Postfach","extern","Nein","Ja",null,"K","Kärnten"]
{"$rows_left_out":2453}
{"sheet":"Strompreis","index":9,"n_rows":126,"n_cols":87,"rows_kept":126,"cut":false,"hidden":true,"merged":[[0,4,0,20]]}
["Strompreisentwicklung am 17.03.09 ",null,null,null,"http://www.e-control.at/portal/page/portal/ECONTROL_HOME/STROM/STROMPREISE/ENDVERBRAUCHERPREISE"]
[]
[null,null,null,null,null,null,null,null,null,null,null,null,null,null,null,null,"Ökostrompreisentwicklung ( für Erzeuger) gemäß energie-Control vom 17.03.09"]
[]
[]
[]
[]
[]
{"$rows_left_out":119}
{"sheet":"Motorbez. Versicherungssteuer","index":10,"n_rows":509,"n_cols":22,"rows_kept":509,"cut":false,"hidden":true,"merged":[[6,6,6,9],[7,6,7,9],[6,2,6,5],[7,2,7,5],[0,11,0,15],[0,4,0,7],[0,0,0,2],[1,4,1,7]]}
["Berechung NEU",null,null,null,"Motorbezogene Versicherungssteuer NEU",null,null,null,null,null,null,"Werte ab 01.10.2020",null,null,null,null,null,"Jahr",null,"Jahr der Anschaffung","CO2 Grenzwert","Leistung Grenzwert"]
["jährliche",null,{"$f":"(IF((Eingabe!M17-$O$5)>5,(Eingabe!M17-$O$5)*$M$5,5*$M$5)+IF((Eingabe!M22-$O$3)>5,(Eingabe!M22-$O$3)*$M$3,5*$M$3))*12","v":509.76000000000005},null,{"$f":"VLOOKUP(Eingabe!C46,'Motorbez. Versicherungssteuer'!A2:C5,3,FALSE)","v":509.76000000000005},null,null,null,null,null,null,null,null,null,null,null,null,null,null,"[a]","[g/km]","[kW]"]
["½-jährliche",null,{"$f":"(IF((Eingabe!M17-$O$5)>5,(Eingabe!M17-$O$5)*$M$5,5*$M$5)+IF((Eingabe!M22-$O$3)>5,(Eingabe!M22-$O$3)*$M$3,5*$M$3))*6","v":254.88000000000002},null,null,null,null,null,null,null,null,"CO2",0.72,"€ pro g/km ab",{"$f":"VLOOKUP(R3,T3:V7,2,TRUE)","v":115},"g/km",null,2020,null,2020,115,65]
["¼-jährliche",null,{"$f":"(IF((Eingabe!M17-$O$5)>5,(Eingabe!M17-$O$5)*$M$5,5*$M$5)+IF((Eingabe!M22-$O$3)>5,(Eingabe!M22-$O$3)*$M$3,5*$M$3))*3","v":127.44000000000001},null,null,null,null,null,null,null,null,null,null,null,null,null,null,null,null,2021,112,64]
["monatliche",null,{"$f":"(IF((Eingabe!M17-$O$5)>5,(Eingabe!M17-$O$5)*$M$5,5*$M$5)+IF((Eingabe!M22-$O$3)>5,(Eingabe!M22-$O$3)*$M$3,5*$M$3))","v":42.480000000000004},null,null,null,null,null,null,null,null,"Leistung",0.72,"€ pro kW ab ",{"$f":"VLOOKUP(R3,T3:V7,3,TRUE)","v":65},"kW",null,null,null,2022,109,63]
[null,null,null,null,null,null,null,null,null,null,null,null,null,null,null,null,null,null,null,2023,106,62]
["Leistung","Staffelung","Motorbezogene Versicherungssteuer (spezifisch)",null,null,null,"Absolutbeträge",null,null,null,null,null,null,null,null,null,null,null,null,2024,103,61]
["[kW]",null,"[€/kW und Monat]",null,null,null,"[€/a]"]
{"$rows_left_out":502}
{"sheet":"Enamo-Tarif","index":11,"n_rows":7,"n_cols":10,"rows_kept":7,"cut":false,"hidden":true,"merged":[[1,0,3,1]]}
[null,null,null,null,null,null,null,null,"Tarif (brutto)","Tarif (brutto) inkl. Pauschalen"]
["Unterbrechbarer Tarif",null,"Arbeitspreis 06:00 – 22:00 Uhr [cent]",7,2.39,1.5,0.77700000000000002,11.667,14,{"$f":"I2+$I$7*100","v":24.646129032258063}]
[null,null,"Arbeitspreis 22:00 – 06:00 Uhr [cent]",5.6,2.39,1.5,0.77700000000000002,10.266999999999999,12.32,{"$f":"I3+$I$7*100","v":22.966129032258063}]
[null,null,"Grundpreis / Pauschale [€/a]",null,null,null,33,33,39.6]
[null,null,"Messleistung für 2. Zähler",null,null,null,null,24.9,{"$f":"H5*1.2","v":29.879999999999995}]
[null,null,null,null,null,null,null,null,{"$f":"SUM(I4:I5)","v":69.47999999999999}]
[null,null,null,null,null,null,null,null,{"$f":"I6/Eingabe!G21","v":0.10646129032258063}]

{"sheet":"topprodukte-elektro","index":12,"n_rows":63,"n_cols":36,"rows_kept":63,"cut":false,"hidden":true,"merged":[]}
["Marke",null,"Modellname",null,"Kaufpreis",null,"Reichweite mind.",null,"Verbrauch",null,"Spitzengeschwindigkeit",null,"Antriebssystem",null,null,null,null,"Leistung [kW]","max. Drehmoment [Nm]",null,"Batterien",null,null,"Energieinhalt [kWh]","Ladezyklen","der Batterie","Ladegerät",null,null,"Standardladezeit","[h]","Sitzplätze","Anmerkung"]
[null,null,null,null,"inkl. MWSt. [EUR]",null,"[km]",null,"[kWh/100 km]",null,"[km/h]"]
["TESLA",null,"Model S",null,65740,null,502,null,18,null,210,null,"Vierpoliger","Dreiphasen","wechselstrom-","Induktionsmotor","mit Kupferläufer",350,600,null,"Li-Ion",null,null,85,"k.A.",null,"Integriertes Ladegerät",null,null,8,null,"5 Sitzer","Erhältlich auch","mit 60 kWh","Batterie"]
["TESLA",null,"Roadster",null,100000,null,350,null,"k.A.",null,200,null,"3-Phasen","Asynchron",null,null,null,185,"k.A.",null,"Li-Ion",null,null,"k.A.","k.A.",null,"k.A.",null,null,4,null,"2 Sitzer"]
["RENAULT",null,"Zoe",null,20780,null,210,null,15,null,135,null,"fremderregter","Synchronmotor","Rekuperation der","bremsenergie",null,65,220,null,"Li-Ion",null,null,22,"k.A.",null,"Mietbatterie","in Fahrzeug","integriert",9,null,"5 Sitzer","Modelle:","Life, Zen,","Intens"]
["Fiat Umbau durch","MP Eco Drive","E-Ducato Kombi",null,108000,null,200,null,"k.A.",null,90,null,"asynchron mit","Wasserkühlung",null,null,null,140,"k.A.",null,"Li-Ion",null,null,62,"k.A.",null,"k.A.",null,null,8,null,"12 Sitzer"]
["NISSAN",null,"Leaf",null,23390,null,199,null,15,null,144,null,"E-Motor",null,null,null,null,90,254,null,"Li-Ion",null,null,24,"k.A.",null,"Mietbatterie","in Fahrzeug","integriert",8,null,"4 Sitzer","Modelle:","Visia,Acenta,","Tekna"]
["BMW",null,"BMW i3",null,35700,null,190,null,13,null,150,null,"E-synchron","motor",null,null,null,125,250,null,"Li-Ion",null,null,"k.A.","k.A.",null,"k.A.",null,null,6,null,"5 Sitzer"]
{"$rows_left_out":56}
{"sheet":"topprodukte-benzin-diesel","index":13,"n_rows":182,"n_cols":36,"rows_kept":182,"cut":false,"hidden":true,"merged":[]}
["MARKE","Modell",null,"Motor",null,"Kaufpreis bei","Grundausstattung","[ab EUR] inkl MWSt.","Kraftstoff","Benzin/Diesel","CO2-Emissionen","[g/km]","EU-Abgasnorm","Sitzplätze","Leistung","[kW]","Leistung","[PS]","Getriebe","Länge [mm]","Breite mit Außenspiegel [mm]","Höhe ohne Dachreeling [mm]","andere Motoren","(Verbrauch, CO2-Emission,","Leistung [kW], Leistung [PS])",null,null,"Modellvarianten"]
["Audi","A1 SB","25 TSFI",null,null,21780,null,null,5.6,"Benzin",126,null,"6d-TEMP",4,70,null,95,null,"M5",3954,1906,1416,1110,"30 TSFI","(4.8,122,85,116)",null,"advanced,","S-line",null,null,"S-line"]
["Audi","A3 SB","30 TDI",null,null,29600,null,null,4.4000000000000004,"Benzin",114,null,"6d-TEMP",5,85,null,115,null,"M6",4313,1785,1426,1360,"35 TDI","(4.4,115,110,150)",null,null,"sport, design",null,null,null,null,null,null,"Auch als Combi","erhältlich"]
["Audi","A4 Limousine","30 TDI",null,null,36970,null,null,4.9000000000000004,"Benzin",128,null,"6d-TEMP",5,90,null,122,null,"M6",4762,2022,1428,1540,"35 TDI","(5.0,131,120,163)","40 TDI","(5.2,136,140,190)","advanced, S line",null,null,null,null,null,null,"Auch als Combi","erhältlich"]
["Audi","A3 SB","30 TDI",null,null,29600,null,null,4.4000000000000004,"Diesel",114,null,"6d-TEMP",5,85,null,115,null,"M6","4 313","1 785","1 426","1 360","35 TDI","(4.4,115,110,150)",null,null,"sport, design"]
["Audi","A4 Limousine","30 TDI",null,null,36970,null,null,4.9000000000000004,"Diesel",128,null,"6d-TEMP",5,90,null,122,null,"M6","4 762","2 022","1 428","1 540","35 TDI","(5.0,131,120,163)","40 TDI","(5.2,136,140,190)","advanced, S line",null,null,"erhältlich"]
["BMW","2er Gran Tourer","216i",null,null,31350,null,null,6.4,"Benzin",146,null,"6d-TEMP",5,80,null,109,null,"AMT6",4556,1800,1608,1515,"218i","(6.5,146,103,140)","220i","(6.8,154,141,192)"]
["BMW","1er Limousine","116d",null,null,31160,null,null,4.5,"Benzin",118,null,"6d",5,85,null,115,null,"M6",4319,1799,1434,1375,"118d","(4.7,122,11,150)"]
{"$rows_left_out":174}